< Back Home

Repository metao1_one


Repository ID
metao1_one
Git URL
https://github.com/metao1/one
Git Hash
HEAD
Jobs
See list of jobs for this repository

DSpot Results

Here is the list of test classes that have been investigated, and the number of newly generated test cases.

NameOriginalTestCasesMutantKilledOriginallyNewMutantKilled

You can download dspot results as a ZIP file here.


Descartes results

You can download Descartes results (i.e. all XML files) as a ZIP file here.


Git execution

"Already up to date.\n"

Maven execution

[INFO] Scanning for projects...
[INFO] ------------------------------------------------------------------------
[INFO] BUILD FAILURE
[INFO] ------------------------------------------------------------------------
[INFO] Total time:  0.084 s
[INFO] Finished at: 2021-02-03T10:05:05Z
[INFO] ------------------------------------------------------------------------
[ERROR] The goal you specified requires a project to execute but there is no POM in this directory (/home/dspot/dspot_data/projects/metao1_one/src). Please verify you invoked Maven from the correct directory. -> [Help 1]
[ERROR] 
[ERROR] To see the full stack trace of the errors, re-run Maven with the -e switch.
[ERROR] Re-run Maven using the -X switch to enable full debug logging.
[ERROR] 
[ERROR] For more information about the errors and possible solutions, please read the following articles:
[ERROR] [Help 1] http://cwiki.apache.org/confluence/display/MAVEN/MissingProjectException

DSpot execution

Analysis type / command used: MAVEN_HOME=/home/dspot/apache-maven-3.6.3/ /home/dspot/apache-maven-3.6.3/bin/mvn eu.stamp-project:dspot-maven:amplify-unit-tests -Doutput-path=../output/dspot

[INFO] Scanning for projects...
[INFO] 
[INFO] ------------------< org.apache.maven:standalone-pom >-------------------
[INFO] Building Maven Stub Project (No POM) 1
[INFO] --------------------------------[ pom ]---------------------------------
[INFO] ------------------------------------------------------------------------
[INFO] BUILD FAILURE
[INFO] ------------------------------------------------------------------------
[INFO] Total time:  0.165 s
[INFO] Finished at: 2021-02-03T10:05:07Z
[INFO] ------------------------------------------------------------------------
[ERROR] Failed to execute goal eu.stamp-project:dspot-maven:3.1.0:amplify-unit-tests (default-cli): Goal requires a project to execute but there is no POM in this directory (/home/dspot/dspot_data/projects/metao1_one/src). Please verify you invoked Maven from the correct directory. -> [Help 1]
[ERROR] 
[ERROR] To see the full stack trace of the errors, re-run Maven with the -e switch.
[ERROR] Re-run Maven using the -X switch to enable full debug logging.
[ERROR] 
[ERROR] For more information about the errors and possible solutions, please read the following articles:
[ERROR] [Help 1] http://cwiki.apache.org/confluence/display/MAVEN/MissingProjectException