< Back Home

Repository codecentric_jbehave-junit-runner


Repository ID
codecentric_jbehave-junit-runner
Git URL
https://github.com/codecentric/jbehave-junit-runner
Git Hash
HEAD
Jobs
See list of jobs for this repository

DSpot Results

Here is the list of test classes that have been investigated, and the number of newly generated test cases.

NameOriginalTestCasesMutantKilledOriginallyNewMutantKilled

You can download dspot results as a ZIP file here.


Descartes results

You can download Descartes results (i.e. all XML files) as a ZIP file here.


Maven execution

[INFO] Scanning for projects...
[WARNING] 
[WARNING] Some problems were encountered while building the effective model for com.github.valfirst:jbehave-junit-runner:jar:2.3.1-SNAPSHOT
[WARNING] 'build.plugins.plugin.version' for org.apache.maven.plugins:maven-surefire-plugin is missing. @ line 116, column 12
[WARNING] 
[WARNING] It is highly recommended to fix these problems because they threaten the stability of your build.
[WARNING] 
[WARNING] For this reason, future Maven versions might no longer support building such malformed projects.
[WARNING] 
[INFO] 
[INFO] --------------< com.github.valfirst:jbehave-junit-runner >--------------
[INFO] Building JBehave JUnit Runner 2.3.1-SNAPSHOT
[INFO] --------------------------------[ jar ]---------------------------------
Downloading from central: https://repo.maven.apache.org/maven2/org/apache/maven/plugins/maven-javadoc-plugin/3.2.0/maven-javadoc-plugin-3.2.0.pom
Progress (1): 2.7/20 kB
Progress (1): 5.5/20 kB
Progress (1): 8.2/20 kB
Progress (1): 11/20 kB 
Progress (1): 14/20 kB
Progress (1): 16/20 kB
Progress (1): 19/20 kB
Progress (1): 20 kB   
                   
Downloaded from central: https://repo.maven.apache.org/maven2/org/apache/maven/plugins/maven-javadoc-plugin/3.2.0/maven-javadoc-plugin-3.2.0.pom (20 kB at 34 kB/s)
Downloading from central: https://repo.maven.apache.org/maven2/org/apache/maven/plugins/maven-javadoc-plugin/3.2.0/maven-javadoc-plugin-3.2.0.jar
Progress (1): 2.7/492 kB
Progress (1): 5.5/492 kB
Progress (1): 8.2/492 kB
Progress (1): 11/492 kB 
Progress (1): 14/492 kB
Progress (1): 16/492 kB
Progress (1): 19/492 kB
Progress (1): 22/492 kB
Progress (1): 25/492 kB
Progress (1): 27/492 kB
Progress (1): 30/492 kB
Progress (1): 33/492 kB
Progress (1): 36/492 kB
Progress (1): 38/492 kB
Progress (1): 41/492 kB
Progress (1): 44/492 kB
Progress (1): 48/492 kB
Progress (1): 52/492 kB
Progress (1): 56/492 kB
Progress (1): 60/492 kB
Progress (1): 64/492 kB
Progress (1): 68/492 kB
Progress (1): 73/492 kB
Progress (1): 77/492 kB
Progress (1): 81/492 kB
Progress (1): 85/492 kB
Progress (1): 89/492 kB
Progress (1): 93/492 kB
Progress (1): 97/492 kB
Progress (1): 101/492 kB
Progress (1): 105/492 kB
Progress (1): 109/492 kB
Progress (1): 114/492 kB
Progress (1): 118/492 kB
Progress (1): 122/492 kB
Progress (1): 126/492 kB
Progress (1): 130/492 kB
Progress (1): 134/492 kB
Progress (1): 138/492 kB
Progress (1): 142/492 kB
Progress (1): 146/492 kB
Progress (1): 150/492 kB
Progress (1): 154/492 kB
Progress (1): 159/492 kB
Progress (1): 163/492 kB
Progress (1): 167/492 kB
Progress (1): 171/492 kB
Progress (1): 175/492 kB
Progress (1): 179/492 kB
Progress (1): 183/492 kB
Progress (1): 187/492 kB
Progress (1): 191/492 kB
Progress (1): 195/492 kB
Progress (1): 200/492 kB
Progress (1): 204/492 kB
Progress (1): 208/492 kB
Progress (1): 212/492 kB
Progress (1): 216/492 kB
Progress (1): 220/492 kB
Progress (1): 224/492 kB
Progress (1): 228/492 kB
Progress (1): 232/492 kB
Progress (1): 236/492 kB
Progress (1): 240/492 kB
Progress (1): 245/492 kB
Progress (1): 249/492 kB
Progress (1): 253/492 kB
Progress (1): 257/492 kB
Progress (1): 261/492 kB
Progress (1): 265/492 kB
Progress (1): 269/492 kB
Progress (1): 273/492 kB
Progress (1): 277/492 kB
Progress (1): 281/492 kB
Progress (1): 286/492 kB
Progress (1): 290/492 kB
Progress (1): 294/492 kB
Progress (1): 298/492 kB
Progress (1): 302/492 kB
Progress (1): 306/492 kB
Progress (1): 310/492 kB
Progress (1): 314/492 kB
Progress (1): 318/492 kB
Progress (1): 322/492 kB
Progress (1): 326/492 kB
Progress (1): 331/492 kB
Progress (1): 335/492 kB
Progress (1): 339/492 kB
Progress (1): 343/492 kB
Progress (1): 347/492 kB
Progress (1): 351/492 kB
Progress (1): 355/492 kB
Progress (1): 359/492 kB
Progress (1): 363/492 kB
Progress (1): 367/492 kB
Progress (1): 372/492 kB
Progress (1): 376/492 kB
Progress (1): 380/492 kB
Progress (1): 384/492 kB
Progress (1): 388/492 kB
Progress (1): 392/492 kB
Progress (1): 396/492 kB
Progress (1): 400/492 kB
Progress (1): 404/492 kB
Progress (1): 408/492 kB
Progress (1): 413/492 kB
Progress (1): 417/492 kB
Progress (1): 421/492 kB
Progress (1): 425/492 kB
Progress (1): 429/492 kB
Progress (1): 433/492 kB
Progress (1): 437/492 kB
Progress (1): 441/492 kB
Progress (1): 445/492 kB
Progress (1): 449/492 kB
Progress (1): 453/492 kB
Progress (1): 458/492 kB
Progress (1): 462/492 kB
Progress (1): 466/492 kB
Progress (1): 470/492 kB
Progress (1): 474/492 kB
Progress (1): 478/492 kB
Progress (1): 482/492 kB
Progress (1): 486/492 kB
Progress (1): 490/492 kB
Progress (1): 492 kB    
                    
Downloaded from central: https://repo.maven.apache.org/maven2/org/apache/maven/plugins/maven-javadoc-plugin/3.2.0/maven-javadoc-plugin-3.2.0.jar (492 kB at 5.5 MB/s)
Downloading from central: https://repo.maven.apache.org/maven2/org/jbehave/jbehave-core/4.8.2/jbehave-core-4.8.2.pom
Progress (1): 4.1/5.5 kB
Progress (1): 5.5 kB    
                    
Downloaded from central: https://repo.maven.apache.org/maven2/org/jbehave/jbehave-core/4.8.2/jbehave-core-4.8.2.pom (5.5 kB at 54 kB/s)
Downloading from central: https://repo.maven.apache.org/maven2/org/jbehave/jbehave/4.8.2/jbehave-4.8.2.pom
Progress (1): 4.1/11 kB
Progress (1): 8.2/11 kB
Progress (1): 11 kB    
                   
Downloaded from central: https://repo.maven.apache.org/maven2/org/jbehave/jbehave/4.8.2/jbehave-4.8.2.pom (11 kB at 59 kB/s)
Downloading from central: https://repo.maven.apache.org/maven2/org/jbehave/jbehave-pom/4/jbehave-pom-4.pom
Progress (1): 4.1/5.5 kB
Progress (1): 5.5 kB    
                    
Downloaded from central: https://repo.maven.apache.org/maven2/org/jbehave/jbehave-pom/4/jbehave-pom-4.pom (5.5 kB at 21 kB/s)
Downloading from central: https://repo.maven.apache.org/maven2/org/freemarker/freemarker/2.3.30/freemarker-2.3.30.pom
Progress (1): 3.4 kB
                    
Downloaded from central: https://repo.maven.apache.org/maven2/org/freemarker/freemarker/2.3.30/freemarker-2.3.30.pom (3.4 kB at 177 kB/s)
Downloading from central: https://repo.maven.apache.org/maven2/com/thoughtworks/paranamer/paranamer/2.8/paranamer-2.8.pom
Progress (1): 4.1/5.3 kB
Progress (1): 5.3 kB    
                    
Downloaded from central: https://repo.maven.apache.org/maven2/com/thoughtworks/paranamer/paranamer/2.8/paranamer-2.8.pom (5.3 kB at 278 kB/s)
Downloading from central: https://repo.maven.apache.org/maven2/com/thoughtworks/paranamer/paranamer-parent/2.8/paranamer-parent-2.8.pom
Progress (1): 4.1/12 kB
Progress (1): 8.2/12 kB
Progress (1): 12 kB    
                   
Downloaded from central: https://repo.maven.apache.org/maven2/com/thoughtworks/paranamer/paranamer-parent/2.8/paranamer-parent-2.8.pom (12 kB at 577 kB/s)
Downloading from central: https://repo.maven.apache.org/maven2/com/thoughtworks/xstream/xstream/1.4.15/xstream-1.4.15.pom
Progress (1): 4.1/22 kB
Progress (1): 8.2/22 kB
Progress (1): 12/22 kB 
Progress (1): 16/22 kB
Progress (1): 20/22 kB
Progress (1): 22 kB   
                   
Downloaded from central: https://repo.maven.apache.org/maven2/com/thoughtworks/xstream/xstream/1.4.15/xstream-1.4.15.pom (22 kB at 952 kB/s)
Downloading from central: https://repo.maven.apache.org/maven2/com/thoughtworks/xstream/xstream-parent/1.4.15/xstream-parent-1.4.15.pom
Progress (1): 4.1/43 kB
Progress (1): 8.2/43 kB
Progress (1): 12/43 kB 
Progress (1): 16/43 kB
Progress (1): 20/43 kB
Progress (1): 25/43 kB
Progress (1): 29/43 kB
Progress (1): 33/43 kB
Progress (1): 37/43 kB
Progress (1): 41/43 kB
Progress (1): 43 kB   
                   
Downloaded from central: https://repo.maven.apache.org/maven2/com/thoughtworks/xstream/xstream-parent/1.4.15/xstream-parent-1.4.15.pom (43 kB at 1.9 MB/s)
Downloading from central: https://repo.maven.apache.org/maven2/org/mockito/mockito-core/3.7.7/mockito-core-3.7.7.pom
Progress (1): 2.5 kB
                    
Downloaded from central: https://repo.maven.apache.org/maven2/org/mockito/mockito-core/3.7.7/mockito-core-3.7.7.pom (2.5 kB at 132 kB/s)
Downloading from central: https://repo.maven.apache.org/maven2/net/bytebuddy/byte-buddy/1.10.19/byte-buddy-1.10.19.pom
Progress (1): 4.1/11 kB
Progress (1): 8.2/11 kB
Progress (1): 11 kB    
                   
Downloaded from central: https://repo.maven.apache.org/maven2/net/bytebuddy/byte-buddy/1.10.19/byte-buddy-1.10.19.pom (11 kB at 552 kB/s)
Downloading from central: https://repo.maven.apache.org/maven2/net/bytebuddy/byte-buddy-parent/1.10.19/byte-buddy-parent-1.10.19.pom
Progress (1): 4.1/42 kB
Progress (1): 8.2/42 kB
Progress (1): 12/42 kB 
Progress (1): 16/42 kB
Progress (1): 20/42 kB
Progress (1): 25/42 kB
Progress (1): 29/42 kB
Progress (1): 33/42 kB
Progress (1): 37/42 kB
Progress (1): 41/42 kB
Progress (1): 42 kB   
                   
Downloaded from central: https://repo.maven.apache.org/maven2/net/bytebuddy/byte-buddy-parent/1.10.19/byte-buddy-parent-1.10.19.pom (42 kB at 1.7 MB/s)
Downloading from central: https://repo.maven.apache.org/maven2/net/bytebuddy/byte-buddy-agent/1.10.19/byte-buddy-agent-1.10.19.pom
Progress (1): 4.1/9.6 kB
Progress (1): 8.2/9.6 kB
Progress (1): 9.6 kB    
                    
Downloaded from central: https://repo.maven.apache.org/maven2/net/bytebuddy/byte-buddy-agent/1.10.19/byte-buddy-agent-1.10.19.pom (9.6 kB at 532 kB/s)
Downloading from central: https://repo.maven.apache.org/maven2/org/objenesis/objenesis/3.1/objenesis-3.1.pom
Progress (1): 3.5 kB
                    
Downloaded from central: https://repo.maven.apache.org/maven2/org/objenesis/objenesis/3.1/objenesis-3.1.pom (3.5 kB at 207 kB/s)
Downloading from central: https://repo.maven.apache.org/maven2/org/objenesis/objenesis-parent/3.1/objenesis-parent-3.1.pom
Progress (1): 4.1/18 kB
Progress (1): 8.2/18 kB
Progress (1): 12/18 kB 
Progress (1): 16/18 kB
Progress (1): 18 kB   
                   
Downloaded from central: https://repo.maven.apache.org/maven2/org/objenesis/objenesis-parent/3.1/objenesis-parent-3.1.pom (18 kB at 882 kB/s)
Downloading from central: https://repo.maven.apache.org/maven2/org/jbehave/jbehave-core/4.8.2/jbehave-core-4.8.2.jar
Downloading from central: https://repo.maven.apache.org/maven2/org/freemarker/freemarker/2.3.30/freemarker-2.3.30.jar
Downloading from central: https://repo.maven.apache.org/maven2/com/thoughtworks/xstream/xstream/1.4.15/xstream-1.4.15.jar
Downloading from central: https://repo.maven.apache.org/maven2/com/thoughtworks/paranamer/paranamer/2.8/paranamer-2.8.jar
Downloading from central: https://repo.maven.apache.org/maven2/org/mockito/mockito-core/3.7.7/mockito-core-3.7.7.jar
Progress (1): 2.7/665 kB
Progress (2): 2.7/665 kB | 2.7/628 kB
Progress (2): 5.5/665 kB | 2.7/628 kB
Progress (2): 5.5/665 kB | 5.5/628 kB
Progress (3): 5.5/665 kB | 5.5/628 kB | 0/1.7 MB
Progress (3): 8.2/665 kB | 5.5/628 kB | 0/1.7 MB
Progress (3): 8.2/665 kB | 8.2/628 kB | 0/1.7 MB
Progress (3): 11/665 kB | 8.2/628 kB | 0/1.7 MB 
Progress (3): 11/665 kB | 8.2/628 kB | 0/1.7 MB
Progress (3): 11/665 kB | 11/628 kB | 0/1.7 MB 
Progress (3): 14/665 kB | 11/628 kB | 0/1.7 MB
Progress (3): 14/665 kB | 14/628 kB | 0/1.7 MB
Progress (3): 14/665 kB | 14/628 kB | 0/1.7 MB
Progress (4): 14/665 kB | 14/628 kB | 0/1.7 MB | 2.7/35 kB
Progress (4): 14/665 kB | 16/628 kB | 0/1.7 MB | 2.7/35 kB
Progress (4): 16/665 kB | 16/628 kB | 0/1.7 MB | 2.7/35 kB
Progress (4): 16/665 kB | 16/628 kB | 0/1.7 MB | 2.7/35 kB
Progress (4): 16/665 kB | 16/628 kB | 0/1.7 MB | 5.5/35 kB
Progress (4): 19/665 kB | 16/628 kB | 0/1.7 MB | 5.5/35 kB
Progress (4): 19/665 kB | 16/628 kB | 0/1.7 MB | 8.2/35 kB
Progress (4): 19/665 kB | 19/628 kB | 0/1.7 MB | 8.2/35 kB
Progress (4): 22/665 kB | 19/628 kB | 0/1.7 MB | 8.2/35 kB
Progress (4): 22/665 kB | 19/628 kB | 0/1.7 MB | 8.2/35 kB
Progress (4): 22/665 kB | 22/628 kB | 0/1.7 MB | 8.2/35 kB
Progress (4): 25/665 kB | 22/628 kB | 0/1.7 MB | 8.2/35 kB
Progress (4): 25/665 kB | 25/628 kB | 0/1.7 MB | 8.2/35 kB
Progress (4): 25/665 kB | 25/628 kB | 0/1.7 MB | 11/35 kB 
Progress (4): 25/665 kB | 25/628 kB | 0/1.7 MB | 11/35 kB
Progress (4): 27/665 kB | 25/628 kB | 0/1.7 MB | 11/35 kB
Progress (4): 27/665 kB | 25/628 kB | 0/1.7 MB | 14/35 kB
Progress (4): 27/665 kB | 27/628 kB | 0/1.7 MB | 14/35 kB
Progress (4): 30/665 kB | 27/628 kB | 0/1.7 MB | 14/35 kB
Progress (4): 30/665 kB | 27/628 kB | 0/1.7 MB | 16/35 kB
Progress (4): 30/665 kB | 30/628 kB | 0/1.7 MB | 16/35 kB
Progress (4): 33/665 kB | 30/628 kB | 0/1.7 MB | 16/35 kB
Progress (4): 33/665 kB | 30/628 kB | 0/1.7 MB | 19/35 kB
Progress (4): 33/665 kB | 30/628 kB | 0.1/1.7 MB | 19/35 kB
Progress (4): 33/665 kB | 30/628 kB | 0.1/1.7 MB | 22/35 kB
Progress (4): 36/665 kB | 30/628 kB | 0.1/1.7 MB | 22/35 kB
Progress (4): 36/665 kB | 33/628 kB | 0.1/1.7 MB | 22/35 kB
Progress (4): 36/665 kB | 33/628 kB | 0.1/1.7 MB | 25/35 kB
Progress (4): 38/665 kB | 33/628 kB | 0.1/1.7 MB | 25/35 kB
Progress (4): 38/665 kB | 33/628 kB | 0.1/1.7 MB | 25/35 kB
Progress (4): 38/665 kB | 36/628 kB | 0.1/1.7 MB | 25/35 kB
Progress (4): 41/665 kB | 36/628 kB | 0.1/1.7 MB | 25/35 kB
Progress (4): 41/665 kB | 36/628 kB | 0.1/1.7 MB | 27/35 kB
Progress (4): 41/665 kB | 38/628 kB | 0.1/1.7 MB | 27/35 kB
Progress (4): 44/665 kB | 38/628 kB | 0.1/1.7 MB | 27/35 kB
Progress (4): 44/665 kB | 38/628 kB | 0.1/1.7 MB | 27/35 kB
Progress (4): 44/665 kB | 41/628 kB | 0.1/1.7 MB | 27/35 kB
Progress (4): 44/665 kB | 41/628 kB | 0.1/1.7 MB | 30/35 kB
Progress (4): 44/665 kB | 41/628 kB | 0.1/1.7 MB | 30/35 kB
Progress (4): 47/665 kB | 41/628 kB | 0.1/1.7 MB | 30/35 kB
Progress (4): 47/665 kB | 41/628 kB | 0.1/1.7 MB | 33/35 kB
Progress (4): 47/665 kB | 44/628 kB | 0.1/1.7 MB | 33/35 kB
Progress (4): 49/665 kB | 44/628 kB | 0.1/1.7 MB | 33/35 kB
Progress (4): 49/665 kB | 47/628 kB | 0.1/1.7 MB | 33/35 kB
Progress (4): 49/665 kB | 47/628 kB | 0.1/1.7 MB | 35 kB   
Progress (4): 52/665 kB | 47/628 kB | 0.1/1.7 MB | 35 kB
Progress (4): 52/665 kB | 47/628 kB | 0.1/1.7 MB | 35 kB
Progress (4): 52/665 kB | 49/628 kB | 0.1/1.7 MB | 35 kB
Progress (4): 52/665 kB | 49/628 kB | 0.1/1.7 MB | 35 kB
Progress (4): 55/665 kB | 49/628 kB | 0.1/1.7 MB | 35 kB
Progress (4): 55/665 kB | 52/628 kB | 0.1/1.7 MB | 35 kB
Progress (4): 55/665 kB | 55/628 kB | 0.1/1.7 MB | 35 kB
Progress (4): 55/665 kB | 55/628 kB | 0.1/1.7 MB | 35 kB
Progress (4): 58/665 kB | 55/628 kB | 0.1/1.7 MB | 35 kB
Progress (4): 58/665 kB | 58/628 kB | 0.1/1.7 MB | 35 kB
Progress (4): 60/665 kB | 58/628 kB | 0.1/1.7 MB | 35 kB
Progress (4): 60/665 kB | 60/628 kB | 0.1/1.7 MB | 35 kB
Progress (4): 60/665 kB | 60/628 kB | 0.1/1.7 MB | 35 kB
Progress (4): 60/665 kB | 63/628 kB | 0.1/1.7 MB | 35 kB
Progress (4): 63/665 kB | 63/628 kB | 0.1/1.7 MB | 35 kB
Progress (4): 63/665 kB | 63/628 kB | 0.1/1.7 MB | 35 kB
Progress (4): 63/665 kB | 66/628 kB | 0.1/1.7 MB | 35 kB
Progress (4): 66/665 kB | 66/628 kB | 0.1/1.7 MB | 35 kB
Progress (4): 66/665 kB | 70/628 kB | 0.1/1.7 MB | 35 kB
Progress (4): 66/665 kB | 70/628 kB | 0.1/1.7 MB | 35 kB
Progress (4): 70/665 kB | 70/628 kB | 0.1/1.7 MB | 35 kB
Progress (4): 70/665 kB | 70/628 kB | 0.1/1.7 MB | 35 kB
Progress (4): 70/665 kB | 74/628 kB | 0.1/1.7 MB | 35 kB
Progress (4): 73/665 kB | 74/628 kB | 0.1/1.7 MB | 35 kB
Progress (4): 73/665 kB | 78/628 kB | 0.1/1.7 MB | 35 kB
Progress (4): 73/665 kB | 78/628 kB | 0.2/1.7 MB | 35 kB
Progress (4): 73/665 kB | 82/628 kB | 0.2/1.7 MB | 35 kB
Progress (4): 73/665 kB | 82/628 kB | 0.2/1.7 MB | 35 kB
Progress (4): 77/665 kB | 82/628 kB | 0.2/1.7 MB | 35 kB
Progress (4): 81/665 kB | 82/628 kB | 0.2/1.7 MB | 35 kB
Progress (4): 81/665 kB | 82/628 kB | 0.2/1.7 MB | 35 kB
Progress (4): 81/665 kB | 86/628 kB | 0.2/1.7 MB | 35 kB
Progress (4): 81/665 kB | 86/628 kB | 0.2/1.7 MB | 35 kB
Progress (4): 85/665 kB | 86/628 kB | 0.2/1.7 MB | 35 kB
Progress (4): 85/665 kB | 90/628 kB | 0.2/1.7 MB | 35 kB
Progress (4): 89/665 kB | 90/628 kB | 0.2/1.7 MB | 35 kB
Progress (4): 89/665 kB | 94/628 kB | 0.2/1.7 MB | 35 kB
Progress (4): 89/665 kB | 99/628 kB | 0.2/1.7 MB | 35 kB
                                                        
Downloaded from central: https://repo.maven.apache.org/maven2/com/thoughtworks/paranamer/paranamer/2.8/paranamer-2.8.jar (35 kB at 423 kB/s)
Progress (3): 89/665 kB | 99/628 kB | 0.2/1.7 MB
                                                
Downloading from central: https://repo.maven.apache.org/maven2/net/bytebuddy/byte-buddy/1.10.19/byte-buddy-1.10.19.jar
Progress (3): 93/665 kB | 99/628 kB | 0.2/1.7 MB
Progress (3): 93/665 kB | 103/628 kB | 0.2/1.7 MB
Progress (3): 93/665 kB | 103/628 kB | 0.2/1.7 MB
Progress (3): 93/665 kB | 107/628 kB | 0.2/1.7 MB
Progress (3): 97/665 kB | 107/628 kB | 0.2/1.7 MB
Progress (3): 97/665 kB | 111/628 kB | 0.2/1.7 MB
Progress (3): 101/665 kB | 111/628 kB | 0.2/1.7 MB
Progress (3): 101/665 kB | 115/628 kB | 0.2/1.7 MB
Progress (3): 105/665 kB | 115/628 kB | 0.2/1.7 MB
Progress (3): 105/665 kB | 115/628 kB | 0.2/1.7 MB
Progress (3): 105/665 kB | 115/628 kB | 0.2/1.7 MB
Progress (3): 105/665 kB | 119/628 kB | 0.2/1.7 MB
Progress (3): 109/665 kB | 119/628 kB | 0.2/1.7 MB
Progress (3): 109/665 kB | 123/628 kB | 0.2/1.7 MB
Progress (3): 114/665 kB | 123/628 kB | 0.2/1.7 MB
Progress (3): 114/665 kB | 123/628 kB | 0.2/1.7 MB
Progress (3): 114/665 kB | 127/628 kB | 0.2/1.7 MB
Progress (3): 114/665 kB | 127/628 kB | 0.2/1.7 MB
Progress (3): 118/665 kB | 127/628 kB | 0.2/1.7 MB
Progress (3): 118/665 kB | 131/628 kB | 0.2/1.7 MB
Progress (3): 122/665 kB | 131/628 kB | 0.2/1.7 MB
Progress (3): 122/665 kB | 131/628 kB | 0.2/1.7 MB
Progress (3): 122/665 kB | 131/628 kB | 0.2/1.7 MB
Progress (3): 122/665 kB | 135/628 kB | 0.2/1.7 MB
Progress (3): 122/665 kB | 140/628 kB | 0.2/1.7 MB
Progress (3): 126/665 kB | 140/628 kB | 0.2/1.7 MB
Progress (3): 126/665 kB | 144/628 kB | 0.2/1.7 MB
Progress (3): 130/665 kB | 144/628 kB | 0.2/1.7 MB
Progress (3): 130/665 kB | 144/628 kB | 0.2/1.7 MB
Progress (3): 134/665 kB | 144/628 kB | 0.2/1.7 MB
Progress (3): 134/665 kB | 148/628 kB | 0.2/1.7 MB
Progress (3): 138/665 kB | 148/628 kB | 0.2/1.7 MB
Progress (3): 138/665 kB | 148/628 kB | 0.3/1.7 MB
Progress (3): 138/665 kB | 152/628 kB | 0.3/1.7 MB
Progress (3): 142/665 kB | 152/628 kB | 0.3/1.7 MB
Progress (3): 142/665 kB | 152/628 kB | 0.3/1.7 MB
Progress (3): 146/665 kB | 152/628 kB | 0.3/1.7 MB
Progress (3): 146/665 kB | 156/628 kB | 0.3/1.7 MB
Progress (3): 150/665 kB | 156/628 kB | 0.3/1.7 MB
Progress (3): 150/665 kB | 156/628 kB | 0.3/1.7 MB
Progress (3): 154/665 kB | 156/628 kB | 0.3/1.7 MB
Progress (3): 154/665 kB | 160/628 kB | 0.3/1.7 MB
Progress (3): 154/665 kB | 164/628 kB | 0.3/1.7 MB
Progress (3): 154/665 kB | 164/628 kB | 0.3/1.7 MB
Progress (3): 154/665 kB | 164/628 kB | 0.3/1.7 MB
Progress (3): 154/665 kB | 168/628 kB | 0.3/1.7 MB
Progress (3): 159/665 kB | 168/628 kB | 0.3/1.7 MB
Progress (4): 159/665 kB | 168/628 kB | 0.3/1.7 MB | 0/3.5 MB
Progress (4): 159/665 kB | 172/628 kB | 0.3/1.7 MB | 0/3.5 MB
Progress (4): 159/665 kB | 172/628 kB | 0.3/1.7 MB | 0/3.5 MB
Progress (4): 163/665 kB | 172/628 kB | 0.3/1.7 MB | 0/3.5 MB
Progress (4): 163/665 kB | 172/628 kB | 0.3/1.7 MB | 0/3.5 MB
Progress (4): 163/665 kB | 176/628 kB | 0.3/1.7 MB | 0/3.5 MB
Progress (4): 167/665 kB | 176/628 kB | 0.3/1.7 MB | 0/3.5 MB
Progress (4): 167/665 kB | 180/628 kB | 0.3/1.7 MB | 0/3.5 MB
Progress (4): 171/665 kB | 180/628 kB | 0.3/1.7 MB | 0/3.5 MB
Progress (4): 171/665 kB | 180/628 kB | 0.3/1.7 MB | 0/3.5 MB
Progress (4): 171/665 kB | 185/628 kB | 0.3/1.7 MB | 0/3.5 MB
Progress (4): 171/665 kB | 185/628 kB | 0.3/1.7 MB | 0/3.5 MB
Progress (4): 171/665 kB | 189/628 kB | 0.3/1.7 MB | 0/3.5 MB
Progress (4): 171/665 kB | 189/628 kB | 0.3/1.7 MB | 0/3.5 MB
Progress (4): 171/665 kB | 193/628 kB | 0.3/1.7 MB | 0/3.5 MB
Progress (4): 175/665 kB | 193/628 kB | 0.3/1.7 MB | 0/3.5 MB
Progress (4): 175/665 kB | 193/628 kB | 0.3/1.7 MB | 0/3.5 MB
Progress (4): 175/665 kB | 197/628 kB | 0.3/1.7 MB | 0/3.5 MB
Progress (4): 175/665 kB | 197/628 kB | 0.3/1.7 MB | 0/3.5 MB
Progress (4): 179/665 kB | 197/628 kB | 0.3/1.7 MB | 0/3.5 MB
Progress (4): 179/665 kB | 197/628 kB | 0.3/1.7 MB | 0.1/3.5 MB
Progress (4): 183/665 kB | 197/628 kB | 0.3/1.7 MB | 0.1/3.5 MB
Progress (4): 183/665 kB | 201/628 kB | 0.3/1.7 MB | 0.1/3.5 MB
Progress (4): 187/665 kB | 201/628 kB | 0.3/1.7 MB | 0.1/3.5 MB
Progress (4): 187/665 kB | 201/628 kB | 0.3/1.7 MB | 0.1/3.5 MB
Progress (4): 187/665 kB | 205/628 kB | 0.3/1.7 MB | 0.1/3.5 MB
Progress (4): 187/665 kB | 205/628 kB | 0.3/1.7 MB | 0.1/3.5 MB
Progress (4): 187/665 kB | 209/628 kB | 0.3/1.7 MB | 0.1/3.5 MB
Progress (4): 187/665 kB | 209/628 kB | 0.4/1.7 MB | 0.1/3.5 MB
Progress (4): 187/665 kB | 213/628 kB | 0.4/1.7 MB | 0.1/3.5 MB
Progress (4): 191/665 kB | 213/628 kB | 0.4/1.7 MB | 0.1/3.5 MB
Progress (4): 195/665 kB | 213/628 kB | 0.4/1.7 MB | 0.1/3.5 MB
Progress (4): 195/665 kB | 217/628 kB | 0.4/1.7 MB | 0.1/3.5 MB
Progress (4): 195/665 kB | 217/628 kB | 0.4/1.7 MB | 0.1/3.5 MB
Progress (4): 200/665 kB | 217/628 kB | 0.4/1.7 MB | 0.1/3.5 MB
Progress (4): 200/665 kB | 217/628 kB | 0.4/1.7 MB | 0.1/3.5 MB
Progress (4): 200/665 kB | 221/628 kB | 0.4/1.7 MB | 0.1/3.5 MB
Progress (4): 200/665 kB | 221/628 kB | 0.4/1.7 MB | 0.1/3.5 MB
Progress (4): 204/665 kB | 221/628 kB | 0.4/1.7 MB | 0.1/3.5 MB
Progress (4): 204/665 kB | 226/628 kB | 0.4/1.7 MB | 0.1/3.5 MB
Progress (4): 204/665 kB | 226/628 kB | 0.4/1.7 MB | 0.1/3.5 MB
Progress (4): 204/665 kB | 230/628 kB | 0.4/1.7 MB | 0.1/3.5 MB
Progress (4): 204/665 kB | 230/628 kB | 0.4/1.7 MB | 0.1/3.5 MB
Progress (4): 208/665 kB | 230/628 kB | 0.4/1.7 MB | 0.1/3.5 MB
Progress (4): 208/665 kB | 230/628 kB | 0.4/1.7 MB | 0.1/3.5 MB
Progress (4): 212/665 kB | 230/628 kB | 0.4/1.7 MB | 0.1/3.5 MB
Progress (4): 212/665 kB | 234/628 kB | 0.4/1.7 MB | 0.1/3.5 MB
Progress (4): 216/665 kB | 234/628 kB | 0.4/1.7 MB | 0.1/3.5 MB
Progress (4): 216/665 kB | 234/628 kB | 0.4/1.7 MB | 0.1/3.5 MB
Progress (4): 220/665 kB | 234/628 kB | 0.4/1.7 MB | 0.1/3.5 MB
Progress (4): 220/665 kB | 238/628 kB | 0.4/1.7 MB | 0.1/3.5 MB
Progress (4): 220/665 kB | 238/628 kB | 0.4/1.7 MB | 0.1/3.5 MB
Progress (4): 220/665 kB | 242/628 kB | 0.4/1.7 MB | 0.1/3.5 MB
Progress (4): 220/665 kB | 242/628 kB | 0.4/1.7 MB | 0.1/3.5 MB
Progress (4): 224/665 kB | 242/628 kB | 0.4/1.7 MB | 0.1/3.5 MB
Progress (4): 224/665 kB | 246/628 kB | 0.4/1.7 MB | 0.1/3.5 MB
Progress (4): 228/665 kB | 246/628 kB | 0.4/1.7 MB | 0.1/3.5 MB
Progress (4): 228/665 kB | 246/628 kB | 0.4/1.7 MB | 0.1/3.5 MB
Progress (4): 228/665 kB | 246/628 kB | 0.4/1.7 MB | 0.1/3.5 MB
Progress (4): 232/665 kB | 246/628 kB | 0.4/1.7 MB | 0.1/3.5 MB
Progress (4): 232/665 kB | 246/628 kB | 0.4/1.7 MB | 0.1/3.5 MB
Progress (4): 232/665 kB | 250/628 kB | 0.4/1.7 MB | 0.1/3.5 MB
Progress (4): 236/665 kB | 250/628 kB | 0.4/1.7 MB | 0.1/3.5 MB
Progress (4): 236/665 kB | 254/628 kB | 0.4/1.7 MB | 0.1/3.5 MB
Progress (4): 236/665 kB | 254/628 kB | 0.4/1.7 MB | 0.2/3.5 MB
Progress (4): 236/665 kB | 258/628 kB | 0.4/1.7 MB | 0.2/3.5 MB
Progress (4): 236/665 kB | 258/628 kB | 0.4/1.7 MB | 0.2/3.5 MB
Progress (4): 240/665 kB | 258/628 kB | 0.4/1.7 MB | 0.2/3.5 MB
Progress (4): 240/665 kB | 262/628 kB | 0.4/1.7 MB | 0.2/3.5 MB
Progress (4): 245/665 kB | 262/628 kB | 0.4/1.7 MB | 0.2/3.5 MB
Progress (4): 245/665 kB | 262/628 kB | 0.4/1.7 MB | 0.2/3.5 MB
Progress (4): 245/665 kB | 262/628 kB | 0.4/1.7 MB | 0.2/3.5 MB
Progress (4): 249/665 kB | 262/628 kB | 0.4/1.7 MB | 0.2/3.5 MB
Progress (4): 249/665 kB | 267/628 kB | 0.4/1.7 MB | 0.2/3.5 MB
Progress (4): 253/665 kB | 267/628 kB | 0.4/1.7 MB | 0.2/3.5 MB
Progress (4): 253/665 kB | 271/628 kB | 0.4/1.7 MB | 0.2/3.5 MB
Progress (4): 253/665 kB | 271/628 kB | 0.4/1.7 MB | 0.2/3.5 MB
Progress (4): 253/665 kB | 275/628 kB | 0.4/1.7 MB | 0.2/3.5 MB
Progress (4): 253/665 kB | 275/628 kB | 0.5/1.7 MB | 0.2/3.5 MB
Progress (4): 253/665 kB | 275/628 kB | 0.5/1.7 MB | 0.2/3.5 MB
Progress (4): 253/665 kB | 279/628 kB | 0.5/1.7 MB | 0.2/3.5 MB
Progress (4): 257/665 kB | 279/628 kB | 0.5/1.7 MB | 0.2/3.5 MB
Progress (4): 257/665 kB | 279/628 kB | 0.5/1.7 MB | 0.2/3.5 MB
Progress (4): 261/665 kB | 279/628 kB | 0.5/1.7 MB | 0.2/3.5 MB
Progress (4): 261/665 kB | 279/628 kB | 0.5/1.7 MB | 0.2/3.5 MB
Progress (4): 261/665 kB | 283/628 kB | 0.5/1.7 MB | 0.2/3.5 MB
Progress (4): 265/665 kB | 283/628 kB | 0.5/1.7 MB | 0.2/3.5 MB
Progress (4): 265/665 kB | 283/628 kB | 0.5/1.7 MB | 0.2/3.5 MB
Progress (4): 265/665 kB | 287/628 kB | 0.5/1.7 MB | 0.2/3.5 MB
Progress (4): 269/665 kB | 287/628 kB | 0.5/1.7 MB | 0.2/3.5 MB
Progress (4): 269/665 kB | 291/628 kB | 0.5/1.7 MB | 0.2/3.5 MB
Progress (4): 269/665 kB | 291/628 kB | 0.5/1.7 MB | 0.2/3.5 MB
Progress (4): 269/665 kB | 295/628 kB | 0.5/1.7 MB | 0.2/3.5 MB
Progress (4): 269/665 kB | 295/628 kB | 0.5/1.7 MB | 0.2/3.5 MB
Progress (4): 273/665 kB | 295/628 kB | 0.5/1.7 MB | 0.2/3.5 MB
Progress (4): 273/665 kB | 295/628 kB | 0.5/1.7 MB | 0.2/3.5 MB
Progress (4): 277/665 kB | 295/628 kB | 0.5/1.7 MB | 0.2/3.5 MB
Progress (4): 277/665 kB | 295/628 kB | 0.5/1.7 MB | 0.2/3.5 MB
Progress (4): 277/665 kB | 299/628 kB | 0.5/1.7 MB | 0.2/3.5 MB
Progress (4): 277/665 kB | 299/628 kB | 0.5/1.7 MB | 0.2/3.5 MB
Progress (4): 281/665 kB | 299/628 kB | 0.5/1.7 MB | 0.2/3.5 MB
Progress (4): 281/665 kB | 303/628 kB | 0.5/1.7 MB | 0.2/3.5 MB
Progress (4): 286/665 kB | 303/628 kB | 0.5/1.7 MB | 0.2/3.5 MB
Progress (4): 286/665 kB | 303/628 kB | 0.5/1.7 MB | 0.2/3.5 MB
Progress (4): 286/665 kB | 307/628 kB | 0.5/1.7 MB | 0.2/3.5 MB
Progress (4): 286/665 kB | 307/628 kB | 0.5/1.7 MB | 0.2/3.5 MB
Progress (4): 290/665 kB | 307/628 kB | 0.5/1.7 MB | 0.2/3.5 MB
Progress (4): 290/665 kB | 312/628 kB | 0.5/1.7 MB | 0.2/3.5 MB
Progress (4): 294/665 kB | 312/628 kB | 0.5/1.7 MB | 0.2/3.5 MB
Progress (4): 294/665 kB | 312/628 kB | 0.5/1.7 MB | 0.2/3.5 MB
Progress (4): 298/665 kB | 312/628 kB | 0.5/1.7 MB | 0.2/3.5 MB
Progress (4): 298/665 kB | 312/628 kB | 0.5/1.7 MB | 0.3/3.5 MB
Progress (4): 302/665 kB | 312/628 kB | 0.5/1.7 MB | 0.3/3.5 MB
Progress (4): 302/665 kB | 316/628 kB | 0.5/1.7 MB | 0.3/3.5 MB
Progress (4): 302/665 kB | 316/628 kB | 0.5/1.7 MB | 0.3/3.5 MB
Progress (4): 302/665 kB | 320/628 kB | 0.5/1.7 MB | 0.3/3.5 MB
Progress (4): 302/665 kB | 320/628 kB | 0.5/1.7 MB | 0.3/3.5 MB
Progress (4): 302/665 kB | 324/628 kB | 0.5/1.7 MB | 0.3/3.5 MB
Progress (4): 306/665 kB | 324/628 kB | 0.5/1.7 MB | 0.3/3.5 MB
Progress (4): 306/665 kB | 324/628 kB | 0.5/1.7 MB | 0.3/3.5 MB
Progress (4): 310/665 kB | 324/628 kB | 0.5/1.7 MB | 0.3/3.5 MB
Progress (4): 310/665 kB | 328/628 kB | 0.5/1.7 MB | 0.3/3.5 MB
Progress (4): 310/665 kB | 328/628 kB | 0.5/1.7 MB | 0.3/3.5 MB
Progress (4): 314/665 kB | 328/628 kB | 0.5/1.7 MB | 0.3/3.5 MB
Progress (4): 314/665 kB | 328/628 kB | 0.6/1.7 MB | 0.3/3.5 MB
Progress (4): 314/665 kB | 328/628 kB | 0.6/1.7 MB | 0.3/3.5 MB
Progress (4): 314/665 kB | 332/628 kB | 0.6/1.7 MB | 0.3/3.5 MB
Progress (4): 318/665 kB | 332/628 kB | 0.6/1.7 MB | 0.3/3.5 MB
Progress (4): 318/665 kB | 336/628 kB | 0.6/1.7 MB | 0.3/3.5 MB
Progress (4): 318/665 kB | 336/628 kB | 0.6/1.7 MB | 0.3/3.5 MB
Progress (4): 318/665 kB | 340/628 kB | 0.6/1.7 MB | 0.3/3.5 MB
Progress (4): 318/665 kB | 340/628 kB | 0.6/1.7 MB | 0.3/3.5 MB
Progress (4): 318/665 kB | 344/628 kB | 0.6/1.7 MB | 0.3/3.5 MB
Progress (4): 318/665 kB | 344/628 kB | 0.6/1.7 MB | 0.3/3.5 MB
Progress (4): 322/665 kB | 344/628 kB | 0.6/1.7 MB | 0.3/3.5 MB
Progress (4): 322/665 kB | 344/628 kB | 0.6/1.7 MB | 0.3/3.5 MB
Progress (4): 327/665 kB | 344/628 kB | 0.6/1.7 MB | 0.3/3.5 MB
Progress (4): 327/665 kB | 344/628 kB | 0.6/1.7 MB | 0.3/3.5 MB
Progress (4): 327/665 kB | 348/628 kB | 0.6/1.7 MB | 0.3/3.5 MB
Progress (4): 327/665 kB | 348/628 kB | 0.6/1.7 MB | 0.3/3.5 MB
Progress (4): 331/665 kB | 348/628 kB | 0.6/1.7 MB | 0.3/3.5 MB
Progress (4): 331/665 kB | 353/628 kB | 0.6/1.7 MB | 0.3/3.5 MB
Progress (4): 335/665 kB | 353/628 kB | 0.6/1.7 MB | 0.3/3.5 MB
Progress (4): 335/665 kB | 353/628 kB | 0.6/1.7 MB | 0.3/3.5 MB
Progress (4): 335/665 kB | 353/628 kB | 0.6/1.7 MB | 0.3/3.5 MB
Progress (4): 335/665 kB | 357/628 kB | 0.6/1.7 MB | 0.3/3.5 MB
Progress (4): 335/665 kB | 357/628 kB | 0.6/1.7 MB | 0.3/3.5 MB
Progress (4): 335/665 kB | 361/628 kB | 0.6/1.7 MB | 0.3/3.5 MB
Progress (4): 339/665 kB | 361/628 kB | 0.6/1.7 MB | 0.3/3.5 MB
Progress (4): 339/665 kB | 361/628 kB | 0.6/1.7 MB | 0.4/3.5 MB
Progress (4): 343/665 kB | 361/628 kB | 0.6/1.7 MB | 0.4/3.5 MB
Progress (4): 343/665 kB | 365/628 kB | 0.6/1.7 MB | 0.4/3.5 MB
Progress (4): 347/665 kB | 365/628 kB | 0.6/1.7 MB | 0.4/3.5 MB
Progress (4): 347/665 kB | 365/628 kB | 0.6/1.7 MB | 0.4/3.5 MB
Progress (4): 347/665 kB | 369/628 kB | 0.6/1.7 MB | 0.4/3.5 MB
Progress (4): 347/665 kB | 369/628 kB | 0.6/1.7 MB | 0.4/3.5 MB
Progress (4): 351/665 kB | 369/628 kB | 0.6/1.7 MB | 0.4/3.5 MB
Progress (4): 351/665 kB | 369/628 kB | 0.6/1.7 MB | 0.4/3.5 MB
Progress (4): 351/665 kB | 373/628 kB | 0.6/1.7 MB | 0.4/3.5 MB
Progress (4): 351/665 kB | 377/628 kB | 0.6/1.7 MB | 0.4/3.5 MB
Progress (4): 351/665 kB | 377/628 kB | 0.6/1.7 MB | 0.4/3.5 MB
Progress (4): 355/665 kB | 377/628 kB | 0.6/1.7 MB | 0.4/3.5 MB
Progress (4): 355/665 kB | 377/628 kB | 0.6/1.7 MB | 0.4/3.5 MB
Progress (4): 355/665 kB | 377/628 kB | 0.6/1.7 MB | 0.4/3.5 MB
Progress (4): 359/665 kB | 377/628 kB | 0.6/1.7 MB | 0.4/3.5 MB
Progress (4): 359/665 kB | 381/628 kB | 0.6/1.7 MB | 0.4/3.5 MB
Progress (4): 363/665 kB | 381/628 kB | 0.6/1.7 MB | 0.4/3.5 MB
Progress (4): 363/665 kB | 385/628 kB | 0.6/1.7 MB | 0.4/3.5 MB
Progress (4): 367/665 kB | 385/628 kB | 0.6/1.7 MB | 0.4/3.5 MB
Progress (4): 367/665 kB | 385/628 kB | 0.6/1.7 MB | 0.4/3.5 MB
Progress (4): 367/665 kB | 385/628 kB | 0.6/1.7 MB | 0.4/3.5 MB
Progress (4): 367/665 kB | 389/628 kB | 0.6/1.7 MB | 0.4/3.5 MB
Progress (4): 367/665 kB | 389/628 kB | 0.6/1.7 MB | 0.4/3.5 MB
Progress (4): 372/665 kB | 389/628 kB | 0.6/1.7 MB | 0.4/3.5 MB
Progress (4): 372/665 kB | 393/628 kB | 0.6/1.7 MB | 0.4/3.5 MB
Progress (4): 376/665 kB | 393/628 kB | 0.6/1.7 MB | 0.4/3.5 MB
Progress (4): 376/665 kB | 393/628 kB | 0.6/1.7 MB | 0.4/3.5 MB
Progress (4): 380/665 kB | 393/628 kB | 0.6/1.7 MB | 0.4/3.5 MB
Progress (4): 380/665 kB | 393/628 kB | 0.7/1.7 MB | 0.4/3.5 MB
Progress (4): 384/665 kB | 393/628 kB | 0.7/1.7 MB | 0.4/3.5 MB
Progress (4): 384/665 kB | 398/628 kB | 0.7/1.7 MB | 0.4/3.5 MB
Progress (4): 384/665 kB | 398/628 kB | 0.7/1.7 MB | 0.4/3.5 MB
Progress (4): 384/665 kB | 398/628 kB | 0.7/1.7 MB | 0.4/3.5 MB
Progress (4): 384/665 kB | 402/628 kB | 0.7/1.7 MB | 0.4/3.5 MB
Progress (4): 384/665 kB | 406/628 kB | 0.7/1.7 MB | 0.4/3.5 MB
Progress (4): 388/665 kB | 406/628 kB | 0.7/1.7 MB | 0.4/3.5 MB
Progress (4): 388/665 kB | 410/628 kB | 0.7/1.7 MB | 0.4/3.5 MB
Progress (4): 388/665 kB | 410/628 kB | 0.7/1.7 MB | 0.5/3.5 MB
Progress (4): 392/665 kB | 410/628 kB | 0.7/1.7 MB | 0.5/3.5 MB
Progress (4): 392/665 kB | 410/628 kB | 0.7/1.7 MB | 0.5/3.5 MB
Progress (4): 396/665 kB | 410/628 kB | 0.7/1.7 MB | 0.5/3.5 MB
Progress (4): 396/665 kB | 410/628 kB | 0.7/1.7 MB | 0.5/3.5 MB
Progress (4): 396/665 kB | 414/628 kB | 0.7/1.7 MB | 0.5/3.5 MB
Progress (4): 396/665 kB | 414/628 kB | 0.7/1.7 MB | 0.5/3.5 MB
Progress (4): 400/665 kB | 414/628 kB | 0.7/1.7 MB | 0.5/3.5 MB
Progress (4): 400/665 kB | 418/628 kB | 0.7/1.7 MB | 0.5/3.5 MB
Progress (4): 400/665 kB | 422/628 kB | 0.7/1.7 MB | 0.5/3.5 MB
Progress (4): 400/665 kB | 426/628 kB | 0.7/1.7 MB | 0.5/3.5 MB
Progress (4): 400/665 kB | 426/628 kB | 0.7/1.7 MB | 0.5/3.5 MB
Progress (4): 400/665 kB | 426/628 kB | 0.7/1.7 MB | 0.5/3.5 MB
Progress (4): 404/665 kB | 426/628 kB | 0.7/1.7 MB | 0.5/3.5 MB
Progress (4): 404/665 kB | 426/628 kB | 0.7/1.7 MB | 0.5/3.5 MB
Progress (4): 408/665 kB | 426/628 kB | 0.7/1.7 MB | 0.5/3.5 MB
Progress (4): 408/665 kB | 430/628 kB | 0.7/1.7 MB | 0.5/3.5 MB
Progress (4): 413/665 kB | 430/628 kB | 0.7/1.7 MB | 0.5/3.5 MB
Progress (4): 413/665 kB | 430/628 kB | 0.7/1.7 MB | 0.5/3.5 MB
Progress (4): 417/665 kB | 430/628 kB | 0.7/1.7 MB | 0.5/3.5 MB
Progress (4): 417/665 kB | 434/628 kB | 0.7/1.7 MB | 0.5/3.5 MB
Progress (4): 417/665 kB | 434/628 kB | 0.7/1.7 MB | 0.5/3.5 MB
Progress (4): 417/665 kB | 439/628 kB | 0.7/1.7 MB | 0.5/3.5 MB
Progress (4): 417/665 kB | 439/628 kB | 0.7/1.7 MB | 0.5/3.5 MB
Progress (4): 417/665 kB | 443/628 kB | 0.7/1.7 MB | 0.5/3.5 MB
Progress (4): 421/665 kB | 443/628 kB | 0.7/1.7 MB | 0.5/3.5 MB
Progress (4): 421/665 kB | 443/628 kB | 0.7/1.7 MB | 0.5/3.5 MB
Progress (4): 425/665 kB | 443/628 kB | 0.7/1.7 MB | 0.5/3.5 MB
Progress (4): 425/665 kB | 447/628 kB | 0.7/1.7 MB | 0.5/3.5 MB
Progress (4): 429/665 kB | 447/628 kB | 0.7/1.7 MB | 0.5/3.5 MB
Progress (4): 429/665 kB | 447/628 kB | 0.7/1.7 MB | 0.5/3.5 MB
Progress (4): 429/665 kB | 451/628 kB | 0.7/1.7 MB | 0.5/3.5 MB
Progress (4): 429/665 kB | 451/628 kB | 0.7/1.7 MB | 0.5/3.5 MB
Progress (4): 433/665 kB | 451/628 kB | 0.7/1.7 MB | 0.5/3.5 MB
Progress (4): 433/665 kB | 455/628 kB | 0.7/1.7 MB | 0.5/3.5 MB
Progress (4): 433/665 kB | 455/628 kB | 0.7/1.7 MB | 0.5/3.5 MB
Progress (4): 433/665 kB | 459/628 kB | 0.7/1.7 MB | 0.5/3.5 MB
Progress (4): 433/665 kB | 459/628 kB | 0.7/1.7 MB | 0.6/3.5 MB
Progress (4): 437/665 kB | 459/628 kB | 0.7/1.7 MB | 0.6/3.5 MB
Progress (4): 437/665 kB | 459/628 kB | 0.7/1.7 MB | 0.6/3.5 MB
Progress (4): 441/665 kB | 459/628 kB | 0.7/1.7 MB | 0.6/3.5 MB
Progress (4): 441/665 kB | 459/628 kB | 0.7/1.7 MB | 0.6/3.5 MB
Progress (4): 441/665 kB | 463/628 kB | 0.7/1.7 MB | 0.6/3.5 MB
Progress (4): 445/665 kB | 463/628 kB | 0.7/1.7 MB | 0.6/3.5 MB
Progress (4): 445/665 kB | 463/628 kB | 0.7/1.7 MB | 0.6/3.5 MB
Progress (4): 449/665 kB | 463/628 kB | 0.7/1.7 MB | 0.6/3.5 MB
Progress (4): 449/665 kB | 467/628 kB | 0.7/1.7 MB | 0.6/3.5 MB
Progress (4): 449/665 kB | 467/628 kB | 0.8/1.7 MB | 0.6/3.5 MB
Progress (4): 449/665 kB | 471/628 kB | 0.8/1.7 MB | 0.6/3.5 MB
Progress (4): 449/665 kB | 471/628 kB | 0.8/1.7 MB | 0.6/3.5 MB
Progress (4): 449/665 kB | 475/628 kB | 0.8/1.7 MB | 0.6/3.5 MB
Progress (4): 449/665 kB | 475/628 kB | 0.8/1.7 MB | 0.6/3.5 MB
Progress (4): 453/665 kB | 475/628 kB | 0.8/1.7 MB | 0.6/3.5 MB
Progress (4): 458/665 kB | 475/628 kB | 0.8/1.7 MB | 0.6/3.5 MB
Progress (4): 462/665 kB | 475/628 kB | 0.8/1.7 MB | 0.6/3.5 MB
Progress (4): 462/665 kB | 480/628 kB | 0.8/1.7 MB | 0.6/3.5 MB
Progress (4): 462/665 kB | 480/628 kB | 0.8/1.7 MB | 0.6/3.5 MB
Progress (4): 462/665 kB | 480/628 kB | 0.8/1.7 MB | 0.6/3.5 MB
Progress (4): 462/665 kB | 480/628 kB | 0.8/1.7 MB | 0.6/3.5 MB
Progress (4): 462/665 kB | 484/628 kB | 0.8/1.7 MB | 0.6/3.5 MB
Progress (4): 466/665 kB | 484/628 kB | 0.8/1.7 MB | 0.6/3.5 MB
Progress (4): 466/665 kB | 488/628 kB | 0.8/1.7 MB | 0.6/3.5 MB
Progress (4): 466/665 kB | 488/628 kB | 0.8/1.7 MB | 0.6/3.5 MB
Progress (4): 466/665 kB | 492/628 kB | 0.8/1.7 MB | 0.6/3.5 MB
Progress (4): 466/665 kB | 492/628 kB | 0.8/1.7 MB | 0.6/3.5 MB
Progress (4): 470/665 kB | 492/628 kB | 0.8/1.7 MB | 0.6/3.5 MB
Progress (4): 470/665 kB | 492/628 kB | 0.8/1.7 MB | 0.6/3.5 MB
Progress (4): 470/665 kB | 492/628 kB | 0.8/1.7 MB | 0.6/3.5 MB
Progress (4): 470/665 kB | 496/628 kB | 0.8/1.7 MB | 0.6/3.5 MB
Progress (4): 474/665 kB | 496/628 kB | 0.8/1.7 MB | 0.6/3.5 MB
Progress (4): 474/665 kB | 500/628 kB | 0.8/1.7 MB | 0.6/3.5 MB
Progress (4): 474/665 kB | 500/628 kB | 0.8/1.7 MB | 0.7/3.5 MB
Progress (4): 478/665 kB | 500/628 kB | 0.8/1.7 MB | 0.7/3.5 MB
Progress (4): 478/665 kB | 500/628 kB | 0.8/1.7 MB | 0.7/3.5 MB
Progress (4): 478/665 kB | 504/628 kB | 0.8/1.7 MB | 0.7/3.5 MB
Progress (4): 478/665 kB | 504/628 kB | 0.8/1.7 MB | 0.7/3.5 MB
Progress (4): 482/665 kB | 504/628 kB | 0.8/1.7 MB | 0.7/3.5 MB
Progress (4): 482/665 kB | 504/628 kB | 0.8/1.7 MB | 0.7/3.5 MB
Progress (4): 482/665 kB | 508/628 kB | 0.8/1.7 MB | 0.7/3.5 MB
Progress (4): 482/665 kB | 508/628 kB | 0.8/1.7 MB | 0.7/3.5 MB
Progress (4): 482/665 kB | 508/628 kB | 0.8/1.7 MB | 0.7/3.5 MB
Progress (4): 486/665 kB | 508/628 kB | 0.8/1.7 MB | 0.7/3.5 MB
Progress (4): 486/665 kB | 508/628 kB | 0.8/1.7 MB | 0.7/3.5 MB
Progress (4): 490/665 kB | 508/628 kB | 0.8/1.7 MB | 0.7/3.5 MB
Progress (4): 490/665 kB | 512/628 kB | 0.8/1.7 MB | 0.7/3.5 MB
Progress (4): 494/665 kB | 512/628 kB | 0.8/1.7 MB | 0.7/3.5 MB
Progress (4): 494/665 kB | 512/628 kB | 0.8/1.7 MB | 0.7/3.5 MB
Progress (4): 499/665 kB | 512/628 kB | 0.8/1.7 MB | 0.7/3.5 MB
Progress (4): 499/665 kB | 516/628 kB | 0.8/1.7 MB | 0.7/3.5 MB
Progress (4): 499/665 kB | 516/628 kB | 0.8/1.7 MB | 0.7/3.5 MB
Progress (4): 499/665 kB | 516/628 kB | 0.8/1.7 MB | 0.7/3.5 MB
Progress (4): 499/665 kB | 520/628 kB | 0.8/1.7 MB | 0.7/3.5 MB
Progress (4): 503/665 kB | 520/628 kB | 0.8/1.7 MB | 0.7/3.5 MB
Progress (4): 503/665 kB | 525/628 kB | 0.8/1.7 MB | 0.7/3.5 MB
Progress (4): 507/665 kB | 525/628 kB | 0.8/1.7 MB | 0.7/3.5 MB
Progress (4): 507/665 kB | 525/628 kB | 0.9/1.7 MB | 0.7/3.5 MB
Progress (4): 507/665 kB | 525/628 kB | 0.9/1.7 MB | 0.7/3.5 MB
Progress (4): 507/665 kB | 529/628 kB | 0.9/1.7 MB | 0.7/3.5 MB
Progress (4): 511/665 kB | 529/628 kB | 0.9/1.7 MB | 0.7/3.5 MB
Progress (4): 511/665 kB | 533/628 kB | 0.9/1.7 MB | 0.7/3.5 MB
Progress (4): 511/665 kB | 533/628 kB | 0.9/1.7 MB | 0.7/3.5 MB
Progress (4): 511/665 kB | 537/628 kB | 0.9/1.7 MB | 0.7/3.5 MB
Progress (4): 515/665 kB | 537/628 kB | 0.9/1.7 MB | 0.7/3.5 MB
Progress (4): 515/665 kB | 541/628 kB | 0.9/1.7 MB | 0.7/3.5 MB
Progress (4): 515/665 kB | 541/628 kB | 0.9/1.7 MB | 0.7/3.5 MB
Progress (4): 515/665 kB | 541/628 kB | 0.9/1.7 MB | 0.7/3.5 MB
Progress (4): 515/665 kB | 541/628 kB | 0.9/1.7 MB | 0.7/3.5 MB
Progress (4): 519/665 kB | 541/628 kB | 0.9/1.7 MB | 0.7/3.5 MB
Progress (4): 519/665 kB | 545/628 kB | 0.9/1.7 MB | 0.7/3.5 MB
Progress (4): 519/665 kB | 545/628 kB | 0.9/1.7 MB | 0.8/3.5 MB
Progress (4): 523/665 kB | 545/628 kB | 0.9/1.7 MB | 0.8/3.5 MB
Progress (4): 523/665 kB | 545/628 kB | 0.9/1.7 MB | 0.8/3.5 MB
Progress (4): 523/665 kB | 549/628 kB | 0.9/1.7 MB | 0.8/3.5 MB
Progress (4): 523/665 kB | 549/628 kB | 0.9/1.7 MB | 0.8/3.5 MB
Progress (4): 527/665 kB | 549/628 kB | 0.9/1.7 MB | 0.8/3.5 MB
Progress (4): 527/665 kB | 549/628 kB | 0.9/1.7 MB | 0.8/3.5 MB
Progress (4): 527/665 kB | 553/628 kB | 0.9/1.7 MB | 0.8/3.5 MB
Progress (4): 531/665 kB | 553/628 kB | 0.9/1.7 MB | 0.8/3.5 MB
Progress (4): 531/665 kB | 553/628 kB | 0.9/1.7 MB | 0.8/3.5 MB
Progress (4): 531/665 kB | 557/628 kB | 0.9/1.7 MB | 0.8/3.5 MB
Progress (4): 531/665 kB | 557/628 kB | 0.9/1.7 MB | 0.8/3.5 MB
Progress (4): 531/665 kB | 557/628 kB | 0.9/1.7 MB | 0.8/3.5 MB
Progress (4): 535/665 kB | 557/628 kB | 0.9/1.7 MB | 0.8/3.5 MB
Progress (4): 539/665 kB | 557/628 kB | 0.9/1.7 MB | 0.8/3.5 MB
Progress (4): 539/665 kB | 557/628 kB | 0.9/1.7 MB | 0.8/3.5 MB
Progress (4): 539/665 kB | 561/628 kB | 0.9/1.7 MB | 0.8/3.5 MB
Progress (4): 544/665 kB | 561/628 kB | 0.9/1.7 MB | 0.8/3.5 MB
Progress (4): 544/665 kB | 561/628 kB | 0.9/1.7 MB | 0.8/3.5 MB
Progress (4): 548/665 kB | 561/628 kB | 0.9/1.7 MB | 0.8/3.5 MB
Progress (4): 548/665 kB | 566/628 kB | 0.9/1.7 MB | 0.8/3.5 MB
Progress (4): 548/665 kB | 566/628 kB | 0.9/1.7 MB | 0.8/3.5 MB
Progress (4): 548/665 kB | 566/628 kB | 0.9/1.7 MB | 0.8/3.5 MB
Progress (4): 548/665 kB | 570/628 kB | 0.9/1.7 MB | 0.8/3.5 MB
Progress (4): 548/665 kB | 574/628 kB | 0.9/1.7 MB | 0.8/3.5 MB
Progress (4): 552/665 kB | 574/628 kB | 0.9/1.7 MB | 0.8/3.5 MB
Progress (4): 552/665 kB | 574/628 kB | 0.9/1.7 MB | 0.8/3.5 MB
Progress (4): 556/665 kB | 574/628 kB | 0.9/1.7 MB | 0.8/3.5 MB
Progress (4): 556/665 kB | 574/628 kB | 0.9/1.7 MB | 0.8/3.5 MB
Progress (4): 560/665 kB | 574/628 kB | 0.9/1.7 MB | 0.8/3.5 MB
Progress (4): 560/665 kB | 574/628 kB | 0.9/1.7 MB | 0.9/3.5 MB
Progress (4): 560/665 kB | 574/628 kB | 0.9/1.7 MB | 0.9/3.5 MB
Progress (4): 560/665 kB | 578/628 kB | 0.9/1.7 MB | 0.9/3.5 MB
Progress (4): 564/665 kB | 578/628 kB | 0.9/1.7 MB | 0.9/3.5 MB
Progress (4): 564/665 kB | 578/628 kB | 0.9/1.7 MB | 0.9/3.5 MB
Progress (4): 564/665 kB | 582/628 kB | 0.9/1.7 MB | 0.9/3.5 MB
Progress (4): 564/665 kB | 582/628 kB | 1.0/1.7 MB | 0.9/3.5 MB
Progress (4): 564/665 kB | 586/628 kB | 1.0/1.7 MB | 0.9/3.5 MB
Progress (4): 564/665 kB | 586/628 kB | 1.0/1.7 MB | 0.9/3.5 MB
Progress (4): 564/665 kB | 586/628 kB | 1.0/1.7 MB | 0.9/3.5 MB
Progress (4): 564/665 kB | 590/628 kB | 1.0/1.7 MB | 0.9/3.5 MB
Progress (4): 568/665 kB | 590/628 kB | 1.0/1.7 MB | 0.9/3.5 MB
Progress (4): 572/665 kB | 590/628 kB | 1.0/1.7 MB | 0.9/3.5 MB
Progress (4): 572/665 kB | 590/628 kB | 1.0/1.7 MB | 0.9/3.5 MB
Progress (4): 576/665 kB | 590/628 kB | 1.0/1.7 MB | 0.9/3.5 MB
Progress (4): 576/665 kB | 590/628 kB | 1.0/1.7 MB | 0.9/3.5 MB
Progress (4): 580/665 kB | 590/628 kB | 1.0/1.7 MB | 0.9/3.5 MB
Progress (4): 580/665 kB | 594/628 kB | 1.0/1.7 MB | 0.9/3.5 MB
Progress (4): 580/665 kB | 594/628 kB | 1.0/1.7 MB | 0.9/3.5 MB
Progress (4): 580/665 kB | 594/628 kB | 1.0/1.7 MB | 0.9/3.5 MB
Progress (4): 580/665 kB | 598/628 kB | 1.0/1.7 MB | 0.9/3.5 MB
Progress (4): 580/665 kB | 602/628 kB | 1.0/1.7 MB | 0.9/3.5 MB
Progress (4): 580/665 kB | 602/628 kB | 1.0/1.7 MB | 0.9/3.5 MB
Progress (4): 585/665 kB | 602/628 kB | 1.0/1.7 MB | 0.9/3.5 MB
Progress (4): 585/665 kB | 602/628 kB | 1.0/1.7 MB | 0.9/3.5 MB
Progress (4): 585/665 kB | 606/628 kB | 1.0/1.7 MB | 0.9/3.5 MB
Progress (4): 585/665 kB | 606/628 kB | 1.0/1.7 MB | 0.9/3.5 MB
Progress (4): 589/665 kB | 606/628 kB | 1.0/1.7 MB | 0.9/3.5 MB
Progress (4): 589/665 kB | 606/628 kB | 1.0/1.7 MB | 1.0/3.5 MB
Progress (4): 593/665 kB | 606/628 kB | 1.0/1.7 MB | 1.0/3.5 MB
Progress (4): 593/665 kB | 611/628 kB | 1.0/1.7 MB | 1.0/3.5 MB
Progress (4): 597/665 kB | 611/628 kB | 1.0/1.7 MB | 1.0/3.5 MB
Progress (4): 597/665 kB | 611/628 kB | 1.0/1.7 MB | 1.0/3.5 MB
Progress (4): 597/665 kB | 615/628 kB | 1.0/1.7 MB | 1.0/3.5 MB
Progress (4): 597/665 kB | 615/628 kB | 1.0/1.7 MB | 1.0/3.5 MB
Progress (4): 597/665 kB | 619/628 kB | 1.0/1.7 MB | 1.0/3.5 MB
Progress (4): 597/665 kB | 619/628 kB | 1.0/1.7 MB | 1.0/3.5 MB
Progress (4): 601/665 kB | 619/628 kB | 1.0/1.7 MB | 1.0/3.5 MB
Progress (4): 601/665 kB | 623/628 kB | 1.0/1.7 MB | 1.0/3.5 MB
Progress (4): 601/665 kB | 623/628 kB | 1.0/1.7 MB | 1.0/3.5 MB
Progress (4): 605/665 kB | 623/628 kB | 1.0/1.7 MB | 1.0/3.5 MB
Progress (4): 605/665 kB | 623/628 kB | 1.0/1.7 MB | 1.0/3.5 MB
Progress (4): 605/665 kB | 627/628 kB | 1.0/1.7 MB | 1.0/3.5 MB
Progress (4): 605/665 kB | 627/628 kB | 1.0/1.7 MB | 1.0/3.5 MB
Progress (4): 609/665 kB | 627/628 kB | 1.0/1.7 MB | 1.0/3.5 MB
Progress (4): 609/665 kB | 628 kB | 1.0/1.7 MB | 1.0/3.5 MB    
Progress (4): 609/665 kB | 628 kB | 1.0/1.7 MB | 1.0/3.5 MB
Progress (4): 613/665 kB | 628 kB | 1.0/1.7 MB | 1.0/3.5 MB
Progress (4): 613/665 kB | 628 kB | 1.0/1.7 MB | 1.0/3.5 MB
Progress (4): 613/665 kB | 628 kB | 1.0/1.7 MB | 1.0/3.5 MB
Progress (4): 613/665 kB | 628 kB | 1.0/1.7 MB | 1.0/3.5 MB
Progress (4): 617/665 kB | 628 kB | 1.0/1.7 MB | 1.0/3.5 MB
Progress (4): 621/665 kB | 628 kB | 1.0/1.7 MB | 1.0/3.5 MB
Progress (4): 626/665 kB | 628 kB | 1.0/1.7 MB | 1.0/3.5 MB
Progress (4): 626/665 kB | 628 kB | 1.0/1.7 MB | 1.0/3.5 MB
Progress (4): 626/665 kB | 628 kB | 1.1/1.7 MB | 1.0/3.5 MB
Progress (4): 630/665 kB | 628 kB | 1.1/1.7 MB | 1.0/3.5 MB
Progress (4): 630/665 kB | 628 kB | 1.1/1.7 MB | 1.0/3.5 MB
Progress (4): 630/665 kB | 628 kB | 1.1/1.7 MB | 1.1/3.5 MB
Progress (4): 630/665 kB | 628 kB | 1.1/1.7 MB | 1.1/3.5 MB
Progress (4): 630/665 kB | 628 kB | 1.1/1.7 MB | 1.1/3.5 MB
Progress (4): 634/665 kB | 628 kB | 1.1/1.7 MB | 1.1/3.5 MB
Progress (4): 634/665 kB | 628 kB | 1.1/1.7 MB | 1.1/3.5 MB
Progress (4): 638/665 kB | 628 kB | 1.1/1.7 MB | 1.1/3.5 MB
Progress (4): 638/665 kB | 628 kB | 1.1/1.7 MB | 1.1/3.5 MB
Progress (4): 642/665 kB | 628 kB | 1.1/1.7 MB | 1.1/3.5 MB
Progress (4): 646/665 kB | 628 kB | 1.1/1.7 MB | 1.1/3.5 MB
Progress (4): 646/665 kB | 628 kB | 1.1/1.7 MB | 1.1/3.5 MB
Progress (4): 646/665 kB | 628 kB | 1.1/1.7 MB | 1.1/3.5 MB
Progress (4): 646/665 kB | 628 kB | 1.1/1.7 MB | 1.1/3.5 MB
Progress (4): 650/665 kB | 628 kB | 1.1/1.7 MB | 1.1/3.5 MB
Progress (4): 650/665 kB | 628 kB | 1.1/1.7 MB | 1.1/3.5 MB
Progress (4): 654/665 kB | 628 kB | 1.1/1.7 MB | 1.1/3.5 MB
Progress (4): 654/665 kB | 628 kB | 1.1/1.7 MB | 1.1/3.5 MB
Progress (4): 658/665 kB | 628 kB | 1.1/1.7 MB | 1.1/3.5 MB
Progress (4): 658/665 kB | 628 kB | 1.1/1.7 MB | 1.1/3.5 MB
Progress (4): 658/665 kB | 628 kB | 1.1/1.7 MB | 1.1/3.5 MB
Progress (4): 662/665 kB | 628 kB | 1.1/1.7 MB | 1.1/3.5 MB
Progress (4): 665 kB | 628 kB | 1.1/1.7 MB | 1.1/3.5 MB    
Progress (4): 665 kB | 628 kB | 1.1/1.7 MB | 1.1/3.5 MB
Progress (4): 665 kB | 628 kB | 1.1/1.7 MB | 1.2/3.5 MB
Progress (4): 665 kB | 628 kB | 1.1/1.7 MB | 1.2/3.5 MB
Progress (4): 665 kB | 628 kB | 1.1/1.7 MB | 1.2/3.5 MB
Progress (4): 665 kB | 628 kB | 1.1/1.7 MB | 1.2/3.5 MB
Progress (4): 665 kB | 628 kB | 1.1/1.7 MB | 1.2/3.5 MB
Progress (4): 665 kB | 628 kB | 1.1/1.7 MB | 1.2/3.5 MB
Progress (4): 665 kB | 628 kB | 1.1/1.7 MB | 1.2/3.5 MB
                                                       
Downloaded from central: https://repo.maven.apache.org/maven2/com/thoughtworks/xstream/xstream/1.4.15/xstream-1.4.15.jar (628 kB at 3.4 MB/s)
Progress (3): 665 kB | 1.1/1.7 MB | 1.2/3.5 MB
Progress (3): 665 kB | 1.2/1.7 MB | 1.2/3.5 MB
                                              
Downloading from central: https://repo.maven.apache.org/maven2/net/bytebuddy/byte-buddy-agent/1.10.19/byte-buddy-agent-1.10.19.jar
Progress (3): 665 kB | 1.2/1.7 MB | 1.2/3.5 MB
Progress (3): 665 kB | 1.2/1.7 MB | 1.2/3.5 MB
Progress (3): 665 kB | 1.2/1.7 MB | 1.3/3.5 MB
Progress (3): 665 kB | 1.2/1.7 MB | 1.3/3.5 MB
Progress (3): 665 kB | 1.2/1.7 MB | 1.3/3.5 MB
Progress (3): 665 kB | 1.2/1.7 MB | 1.3/3.5 MB
Progress (3): 665 kB | 1.2/1.7 MB | 1.3/3.5 MB
Progress (3): 665 kB | 1.2/1.7 MB | 1.3/3.5 MB
Progress (3): 665 kB | 1.2/1.7 MB | 1.3/3.5 MB
Progress (3): 665 kB | 1.2/1.7 MB | 1.3/3.5 MB
Progress (3): 665 kB | 1.2/1.7 MB | 1.3/3.5 MB
Progress (3): 665 kB | 1.2/1.7 MB | 1.3/3.5 MB
Progress (3): 665 kB | 1.2/1.7 MB | 1.3/3.5 MB
Progress (3): 665 kB | 1.2/1.7 MB | 1.3/3.5 MB
Progress (3): 665 kB | 1.2/1.7 MB | 1.3/3.5 MB
Progress (3): 665 kB | 1.2/1.7 MB | 1.3/3.5 MB
Progress (3): 665 kB | 1.2/1.7 MB | 1.3/3.5 MB
Progress (3): 665 kB | 1.2/1.7 MB | 1.3/3.5 MB
                                              
Downloaded from central: https://repo.maven.apache.org/maven2/org/mockito/mockito-core/3.7.7/mockito-core-3.7.7.jar (665 kB at 3.5 MB/s)
Progress (2): 1.2/1.7 MB | 1.3/3.5 MB
Progress (2): 1.2/1.7 MB | 1.4/3.5 MB
                                     
Downloading from central: https://repo.maven.apache.org/maven2/org/objenesis/objenesis/3.1/objenesis-3.1.jar
Progress (2): 1.3/1.7 MB | 1.4/3.5 MB
Progress (2): 1.3/1.7 MB | 1.4/3.5 MB
Progress (2): 1.3/1.7 MB | 1.4/3.5 MB
Progress (2): 1.3/1.7 MB | 1.4/3.5 MB
Progress (2): 1.3/1.7 MB | 1.4/3.5 MB
Progress (2): 1.3/1.7 MB | 1.4/3.5 MB
Progress (2): 1.3/1.7 MB | 1.4/3.5 MB
Progress (2): 1.3/1.7 MB | 1.4/3.5 MB
Progress (2): 1.3/1.7 MB | 1.4/3.5 MB
Progress (2): 1.3/1.7 MB | 1.5/3.5 MB
Progress (3): 1.3/1.7 MB | 1.5/3.5 MB | 4.1/259 kB
Progress (3): 1.3/1.7 MB | 1.5/3.5 MB | 8.2/259 kB
Progress (3): 1.3/1.7 MB | 1.5/3.5 MB | 8.2/259 kB
Progress (3): 1.3/1.7 MB | 1.5/3.5 MB | 12/259 kB 
Progress (3): 1.3/1.7 MB | 1.5/3.5 MB | 12/259 kB
Progress (3): 1.3/1.7 MB | 1.5/3.5 MB | 16/259 kB
Progress (3): 1.3/1.7 MB | 1.5/3.5 MB | 16/259 kB
Progress (3): 1.3/1.7 MB | 1.5/3.5 MB | 16/259 kB
Progress (3): 1.3/1.7 MB | 1.5/3.5 MB | 16/259 kB
Progress (3): 1.3/1.7 MB | 1.5/3.5 MB | 20/259 kB
Progress (3): 1.3/1.7 MB | 1.5/3.5 MB | 25/259 kB
Progress (3): 1.3/1.7 MB | 1.5/3.5 MB | 25/259 kB
Progress (3): 1.3/1.7 MB | 1.5/3.5 MB | 25/259 kB
Progress (3): 1.3/1.7 MB | 1.5/3.5 MB | 29/259 kB
Progress (3): 1.3/1.7 MB | 1.5/3.5 MB | 29/259 kB
Progress (3): 1.3/1.7 MB | 1.5/3.5 MB | 33/259 kB
Progress (3): 1.3/1.7 MB | 1.5/3.5 MB | 33/259 kB
Progress (3): 1.3/1.7 MB | 1.6/3.5 MB | 33/259 kB
Progress (3): 1.3/1.7 MB | 1.6/3.5 MB | 33/259 kB
Progress (3): 1.3/1.7 MB | 1.6/3.5 MB | 37/259 kB
Progress (3): 1.3/1.7 MB | 1.6/3.5 MB | 37/259 kB
Progress (3): 1.3/1.7 MB | 1.6/3.5 MB | 41/259 kB
Progress (3): 1.3/1.7 MB | 1.6/3.5 MB | 41/259 kB
Progress (3): 1.3/1.7 MB | 1.6/3.5 MB | 45/259 kB
Progress (3): 1.3/1.7 MB | 1.6/3.5 MB | 45/259 kB
Progress (3): 1.3/1.7 MB | 1.6/3.5 MB | 49/259 kB
Progress (3): 1.3/1.7 MB | 1.6/3.5 MB | 49/259 kB
Progress (3): 1.4/1.7 MB | 1.6/3.5 MB | 49/259 kB
Progress (3): 1.4/1.7 MB | 1.6/3.5 MB | 49/259 kB
Progress (3): 1.4/1.7 MB | 1.6/3.5 MB | 49/259 kB
Progress (3): 1.4/1.7 MB | 1.6/3.5 MB | 53/259 kB
Progress (3): 1.4/1.7 MB | 1.6/3.5 MB | 57/259 kB
Progress (3): 1.4/1.7 MB | 1.6/3.5 MB | 57/259 kB
Progress (3): 1.4/1.7 MB | 1.6/3.5 MB | 61/259 kB
Progress (3): 1.4/1.7 MB | 1.6/3.5 MB | 61/259 kB
Progress (3): 1.4/1.7 MB | 1.6/3.5 MB | 61/259 kB
Progress (3): 1.4/1.7 MB | 1.6/3.5 MB | 66/259 kB
Progress (3): 1.4/1.7 MB | 1.6/3.5 MB | 66/259 kB
Progress (3): 1.4/1.7 MB | 1.6/3.5 MB | 66/259 kB
Progress (3): 1.4/1.7 MB | 1.6/3.5 MB | 66/259 kB
Progress (3): 1.4/1.7 MB | 1.6/3.5 MB | 70/259 kB
Progress (3): 1.4/1.7 MB | 1.6/3.5 MB | 74/259 kB
Progress (3): 1.4/1.7 MB | 1.7/3.5 MB | 74/259 kB
Progress (3): 1.4/1.7 MB | 1.7/3.5 MB | 74/259 kB
Progress (3): 1.4/1.7 MB | 1.7/3.5 MB | 78/259 kB
Progress (3): 1.4/1.7 MB | 1.7/3.5 MB | 78/259 kB
Progress (3): 1.4/1.7 MB | 1.7/3.5 MB | 82/259 kB
Progress (3): 1.4/1.7 MB | 1.7/3.5 MB | 82/259 kB
Progress (3): 1.4/1.7 MB | 1.7/3.5 MB | 82/259 kB
Progress (3): 1.4/1.7 MB | 1.7/3.5 MB | 82/259 kB
Progress (3): 1.4/1.7 MB | 1.7/3.5 MB | 86/259 kB
Progress (3): 1.4/1.7 MB | 1.7/3.5 MB | 86/259 kB
Progress (3): 1.4/1.7 MB | 1.7/3.5 MB | 90/259 kB
Progress (3): 1.4/1.7 MB | 1.7/3.5 MB | 94/259 kB
Progress (3): 1.4/1.7 MB | 1.7/3.5 MB | 98/259 kB
Progress (3): 1.4/1.7 MB | 1.7/3.5 MB | 98/259 kB
Progress (3): 1.4/1.7 MB | 1.7/3.5 MB | 98/259 kB
Progress (3): 1.4/1.7 MB | 1.7/3.5 MB | 98/259 kB
Progress (3): 1.4/1.7 MB | 1.7/3.5 MB | 102/259 kB
Progress (4): 1.4/1.7 MB | 1.7/3.5 MB | 102/259 kB | 4.1/60 kB
Progress (4): 1.4/1.7 MB | 1.7/3.5 MB | 106/259 kB | 4.1/60 kB
Progress (4): 1.4/1.7 MB | 1.7/3.5 MB | 106/259 kB | 8.2/60 kB
Progress (4): 1.4/1.7 MB | 1.7/3.5 MB | 111/259 kB | 8.2/60 kB
Progress (4): 1.5/1.7 MB | 1.7/3.5 MB | 111/259 kB | 8.2/60 kB
Progress (4): 1.5/1.7 MB | 1.7/3.5 MB | 115/259 kB | 8.2/60 kB
Progress (4): 1.5/1.7 MB | 1.7/3.5 MB | 115/259 kB | 8.2/60 kB
Progress (4): 1.5/1.7 MB | 1.7/3.5 MB | 115/259 kB | 8.2/60 kB
Progress (4): 1.5/1.7 MB | 1.7/3.5 MB | 115/259 kB | 12/60 kB 
Progress (4): 1.5/1.7 MB | 1.7/3.5 MB | 119/259 kB | 12/60 kB
Progress (4): 1.5/1.7 MB | 1.7/3.5 MB | 119/259 kB | 16/60 kB
Progress (4): 1.5/1.7 MB | 1.7/3.5 MB | 123/259 kB | 16/60 kB
Progress (4): 1.5/1.7 MB | 1.7/3.5 MB | 123/259 kB | 16/60 kB
Progress (4): 1.5/1.7 MB | 1.7/3.5 MB | 127/259 kB | 16/60 kB
Progress (4): 1.5/1.7 MB | 1.7/3.5 MB | 127/259 kB | 16/60 kB
Progress (4): 1.5/1.7 MB | 1.7/3.5 MB | 127/259 kB | 16/60 kB
Progress (4): 1.5/1.7 MB | 1.7/3.5 MB | 127/259 kB | 20/60 kB
Progress (4): 1.5/1.7 MB | 1.7/3.5 MB | 131/259 kB | 20/60 kB
Progress (4): 1.5/1.7 MB | 1.7/3.5 MB | 131/259 kB | 25/60 kB
Progress (4): 1.5/1.7 MB | 1.7/3.5 MB | 131/259 kB | 25/60 kB
Progress (4): 1.5/1.7 MB | 1.7/3.5 MB | 131/259 kB | 29/60 kB
Progress (4): 1.5/1.7 MB | 1.7/3.5 MB | 131/259 kB | 29/60 kB
Progress (4): 1.5/1.7 MB | 1.8/3.5 MB | 131/259 kB | 29/60 kB
Progress (4): 1.5/1.7 MB | 1.8/3.5 MB | 131/259 kB | 33/60 kB
Progress (4): 1.5/1.7 MB | 1.8/3.5 MB | 135/259 kB | 33/60 kB
Progress (4): 1.5/1.7 MB | 1.8/3.5 MB | 139/259 kB | 33/60 kB
Progress (4): 1.5/1.7 MB | 1.8/3.5 MB | 139/259 kB | 33/60 kB
Progress (4): 1.5/1.7 MB | 1.8/3.5 MB | 143/259 kB | 33/60 kB
Progress (4): 1.5/1.7 MB | 1.8/3.5 MB | 143/259 kB | 37/60 kB
Progress (4): 1.5/1.7 MB | 1.8/3.5 MB | 143/259 kB | 37/60 kB
Progress (4): 1.5/1.7 MB | 1.8/3.5 MB | 143/259 kB | 37/60 kB
Progress (4): 1.5/1.7 MB | 1.8/3.5 MB | 143/259 kB | 41/60 kB
Progress (4): 1.5/1.7 MB | 1.8/3.5 MB | 147/259 kB | 41/60 kB
Progress (4): 1.5/1.7 MB | 1.8/3.5 MB | 147/259 kB | 45/60 kB
Progress (4): 1.5/1.7 MB | 1.8/3.5 MB | 147/259 kB | 45/60 kB
Progress (4): 1.5/1.7 MB | 1.8/3.5 MB | 147/259 kB | 49/60 kB
Progress (4): 1.5/1.7 MB | 1.8/3.5 MB | 147/259 kB | 49/60 kB
Progress (4): 1.5/1.7 MB | 1.8/3.5 MB | 152/259 kB | 49/60 kB
Progress (4): 1.5/1.7 MB | 1.8/3.5 MB | 152/259 kB | 49/60 kB
Progress (4): 1.5/1.7 MB | 1.8/3.5 MB | 156/259 kB | 49/60 kB
Progress (4): 1.5/1.7 MB | 1.8/3.5 MB | 156/259 kB | 49/60 kB
Progress (4): 1.5/1.7 MB | 1.8/3.5 MB | 156/259 kB | 53/60 kB
Progress (4): 1.5/1.7 MB | 1.8/3.5 MB | 160/259 kB | 53/60 kB
Progress (4): 1.5/1.7 MB | 1.8/3.5 MB | 160/259 kB | 57/60 kB
Progress (4): 1.5/1.7 MB | 1.8/3.5 MB | 164/259 kB | 57/60 kB
Progress (4): 1.5/1.7 MB | 1.8/3.5 MB | 164/259 kB | 57/60 kB
Progress (4): 1.5/1.7 MB | 1.8/3.5 MB | 164/259 kB | 57/60 kB
Progress (4): 1.5/1.7 MB | 1.8/3.5 MB | 168/259 kB | 57/60 kB
Progress (4): 1.5/1.7 MB | 1.8/3.5 MB | 172/259 kB | 57/60 kB
Progress (4): 1.5/1.7 MB | 1.8/3.5 MB | 176/259 kB | 57/60 kB
Progress (4): 1.5/1.7 MB | 1.8/3.5 MB | 180/259 kB | 57/60 kB
Progress (4): 1.5/1.7 MB | 1.8/3.5 MB | 180/259 kB | 57/60 kB
Progress (4): 1.5/1.7 MB | 1.9/3.5 MB | 180/259 kB | 57/60 kB
Progress (4): 1.5/1.7 MB | 1.9/3.5 MB | 180/259 kB | 60 kB   
Progress (4): 1.5/1.7 MB | 1.9/3.5 MB | 184/259 kB | 60 kB
Progress (4): 1.5/1.7 MB | 1.9/3.5 MB | 188/259 kB | 60 kB
Progress (4): 1.5/1.7 MB | 1.9/3.5 MB | 188/259 kB | 60 kB
Progress (4): 1.5/1.7 MB | 1.9/3.5 MB | 193/259 kB | 60 kB
Progress (4): 1.5/1.7 MB | 1.9/3.5 MB | 193/259 kB | 60 kB
Progress (4): 1.5/1.7 MB | 1.9/3.5 MB | 197/259 kB | 60 kB
Progress (4): 1.6/1.7 MB | 1.9/3.5 MB | 197/259 kB | 60 kB
Progress (4): 1.6/1.7 MB | 1.9/3.5 MB | 197/259 kB | 60 kB
Progress (4): 1.6/1.7 MB | 1.9/3.5 MB | 201/259 kB | 60 kB
Progress (4): 1.6/1.7 MB | 1.9/3.5 MB | 201/259 kB | 60 kB
Progress (4): 1.6/1.7 MB | 1.9/3.5 MB | 205/259 kB | 60 kB
Progress (4): 1.6/1.7 MB | 1.9/3.5 MB | 209/259 kB | 60 kB
Progress (4): 1.6/1.7 MB | 1.9/3.5 MB | 213/259 kB | 60 kB
Progress (4): 1.6/1.7 MB | 1.9/3.5 MB | 213/259 kB | 60 kB
Progress (4): 1.6/1.7 MB | 1.9/3.5 MB | 213/259 kB | 60 kB
Progress (4): 1.6/1.7 MB | 1.9/3.5 MB | 213/259 kB | 60 kB
Progress (4): 1.6/1.7 MB | 1.9/3.5 MB | 217/259 kB | 60 kB
Progress (4): 1.6/1.7 MB | 1.9/3.5 MB | 221/259 kB | 60 kB
Progress (4): 1.6/1.7 MB | 1.9/3.5 MB | 225/259 kB | 60 kB
Progress (4): 1.6/1.7 MB | 1.9/3.5 MB | 229/259 kB | 60 kB
Progress (4): 1.6/1.7 MB | 1.9/3.5 MB | 229/259 kB | 60 kB
Progress (4): 1.6/1.7 MB | 1.9/3.5 MB | 229/259 kB | 60 kB
Progress (4): 1.6/1.7 MB | 1.9/3.5 MB | 229/259 kB | 60 kB
Progress (4): 1.6/1.7 MB | 1.9/3.5 MB | 233/259 kB | 60 kB
Progress (4): 1.6/1.7 MB | 1.9/3.5 MB | 238/259 kB | 60 kB
Progress (4): 1.6/1.7 MB | 1.9/3.5 MB | 238/259 kB | 60 kB
Progress (4): 1.6/1.7 MB | 1.9/3.5 MB | 242/259 kB | 60 kB
Progress (4): 1.6/1.7 MB | 1.9/3.5 MB | 242/259 kB | 60 kB
Progress (4): 1.6/1.7 MB | 1.9/3.5 MB | 246/259 kB | 60 kB
Progress (4): 1.6/1.7 MB | 1.9/3.5 MB | 246/259 kB | 60 kB
Progress (4): 1.6/1.7 MB | 2.0/3.5 MB | 246/259 kB | 60 kB
Progress (4): 1.6/1.7 MB | 2.0/3.5 MB | 250/259 kB | 60 kB
Progress (4): 1.6/1.7 MB | 2.0/3.5 MB | 254/259 kB | 60 kB
Progress (4): 1.6/1.7 MB | 2.0/3.5 MB | 254/259 kB | 60 kB
Progress (4): 1.6/1.7 MB | 2.0/3.5 MB | 258/259 kB | 60 kB
Progress (4): 1.6/1.7 MB | 2.0/3.5 MB | 258/259 kB | 60 kB
Progress (4): 1.6/1.7 MB | 2.0/3.5 MB | 258/259 kB | 60 kB
Progress (4): 1.6/1.7 MB | 2.0/3.5 MB | 259 kB | 60 kB    
Progress (4): 1.6/1.7 MB | 2.0/3.5 MB | 259 kB | 60 kB
Progress (4): 1.7/1.7 MB | 2.0/3.5 MB | 259 kB | 60 kB
Progress (4): 1.7/1.7 MB | 2.0/3.5 MB | 259 kB | 60 kB
Progress (4): 1.7/1.7 MB | 2.0/3.5 MB | 259 kB | 60 kB
Progress (4): 1.7/1.7 MB | 2.0/3.5 MB | 259 kB | 60 kB
Progress (4): 1.7/1.7 MB | 2.0/3.5 MB | 259 kB | 60 kB
Progress (4): 1.7/1.7 MB | 2.0/3.5 MB | 259 kB | 60 kB
Progress (4): 1.7/1.7 MB | 2.0/3.5 MB | 259 kB | 60 kB
Progress (4): 1.7/1.7 MB | 2.0/3.5 MB | 259 kB | 60 kB
Progress (4): 1.7/1.7 MB | 2.0/3.5 MB | 259 kB | 60 kB
Progress (4): 1.7/1.7 MB | 2.0/3.5 MB | 259 kB | 60 kB
Progress (4): 1.7/1.7 MB | 2.0/3.5 MB | 259 kB | 60 kB
Progress (4): 1.7 MB | 2.0/3.5 MB | 259 kB | 60 kB    
Progress (4): 1.7 MB | 2.1/3.5 MB | 259 kB | 60 kB
Progress (4): 1.7 MB | 2.1/3.5 MB | 259 kB | 60 kB
                                                  
Downloaded from central: https://repo.maven.apache.org/maven2/net/bytebuddy/byte-buddy-agent/1.10.19/byte-buddy-agent-1.10.19.jar (259 kB at 1.1 MB/s)
Progress (3): 1.7 MB | 2.1/3.5 MB | 60 kB
Progress (3): 1.7 MB | 2.1/3.5 MB | 60 kB
Progress (3): 1.7 MB | 2.1/3.5 MB | 60 kB
Progress (3): 1.7 MB | 2.1/3.5 MB | 60 kB
Progress (3): 1.7 MB | 2.2/3.5 MB | 60 kB
Progress (3): 1.7 MB | 2.2/3.5 MB | 60 kB
                                         
Downloaded from central: https://repo.maven.apache.org/maven2/org/objenesis/objenesis/3.1/objenesis-3.1.jar (60 kB at 247 kB/s)
Progress (2): 1.7 MB | 2.2/3.5 MB
                                 
Downloaded from central: https://repo.maven.apache.org/maven2/org/freemarker/freemarker/2.3.30/freemarker-2.3.30.jar (1.7 MB at 6.9 MB/s)
Progress (1): 2.2/3.5 MB
Progress (1): 2.2/3.5 MB
Progress (1): 2.2/3.5 MB
Progress (1): 2.3/3.5 MB
Progress (1): 2.3/3.5 MB
Progress (1): 2.3/3.5 MB
Progress (1): 2.3/3.5 MB
Progress (1): 2.3/3.5 MB
Progress (1): 2.3/3.5 MB
Progress (1): 2.4/3.5 MB
Progress (1): 2.4/3.5 MB
Progress (1): 2.4/3.5 MB
Progress (1): 2.4/3.5 MB
Progress (1): 2.4/3.5 MB
Progress (1): 2.4/3.5 MB
Progress (1): 2.5/3.5 MB
Progress (1): 2.5/3.5 MB
Progress (1): 2.5/3.5 MB
Progress (1): 2.5/3.5 MB
Progress (1): 2.5/3.5 MB
Progress (1): 2.5/3.5 MB
Progress (1): 2.6/3.5 MB
Progress (1): 2.6/3.5 MB
Progress (1): 2.6/3.5 MB
Progress (1): 2.6/3.5 MB
Progress (1): 2.6/3.5 MB
Progress (1): 2.6/3.5 MB
Progress (1): 2.7/3.5 MB
Progress (1): 2.7/3.5 MB
Progress (1): 2.7/3.5 MB
Progress (1): 2.7/3.5 MB
Progress (1): 2.7/3.5 MB
Progress (1): 2.7/3.5 MB
Progress (1): 2.8/3.5 MB
Progress (1): 2.8/3.5 MB
Progress (1): 2.8/3.5 MB
Progress (1): 2.8/3.5 MB
Progress (1): 2.8/3.5 MB
Progress (1): 2.8/3.5 MB
Progress (1): 2.8/3.5 MB
Progress (1): 2.9/3.5 MB
Progress (1): 2.9/3.5 MB
Progress (1): 2.9/3.5 MB
Progress (1): 2.9/3.5 MB
Progress (1): 2.9/3.5 MB
Progress (1): 2.9/3.5 MB
Progress (1): 3.0/3.5 MB
Progress (1): 3.0/3.5 MB
Progress (1): 3.0/3.5 MB
Progress (1): 3.0/3.5 MB
Progress (1): 3.0/3.5 MB
Progress (1): 3.0/3.5 MB
Progress (1): 3.1/3.5 MB
Progress (1): 3.1/3.5 MB
Progress (1): 3.1/3.5 MB
Progress (1): 3.1/3.5 MB
Progress (1): 3.1/3.5 MB
Progress (1): 3.1/3.5 MB
Progress (1): 3.2/3.5 MB
Progress (1): 3.2/3.5 MB
Progress (1): 3.2/3.5 MB
Progress (1): 3.2/3.5 MB
Progress (1): 3.2/3.5 MB
Progress (1): 3.2/3.5 MB
Progress (1): 3.3/3.5 MB
Progress (1): 3.3/3.5 MB
Progress (1): 3.3/3.5 MB
Progress (1): 3.3/3.5 MB
Progress (1): 3.3/3.5 MB
Progress (1): 3.3/3.5 MB
Progress (1): 3.4/3.5 MB
Progress (1): 3.4/3.5 MB
Progress (1): 3.4/3.5 MB
Progress (1): 3.4/3.5 MB
Progress (1): 3.4/3.5 MB
Progress (1): 3.5/3.5 MB
Progress (1): 3.5/3.5 MB
Progress (1): 3.5/3.5 MB
Progress (1): 3.5 MB    
                    
Downloaded from central: https://repo.maven.apache.org/maven2/net/bytebuddy/byte-buddy/1.10.19/byte-buddy-1.10.19.jar (3.5 MB at 11 MB/s)
Progress (1): 8.2/827 kB
Progress (1): 16/827 kB 
Progress (1): 25/827 kB
Progress (1): 33/827 kB
Progress (1): 41/827 kB
Progress (1): 49/827 kB
Progress (1): 57/827 kB
Progress (1): 66/827 kB
Progress (1): 74/827 kB
Progress (1): 82/827 kB
Progress (1): 90/827 kB
Progress (1): 98/827 kB
Progress (1): 106/827 kB
Progress (1): 115/827 kB
Progress (1): 123/827 kB
Progress (1): 131/827 kB
Progress (1): 139/827 kB
Progress (1): 147/827 kB
Progress (1): 156/827 kB
Progress (1): 164/827 kB
Progress (1): 172/827 kB
Progress (1): 180/827 kB
Progress (1): 188/827 kB
Progress (1): 197/827 kB
Progress (1): 205/827 kB
Progress (1): 213/827 kB
Progress (1): 221/827 kB
Progress (1): 229/827 kB
Progress (1): 238/827 kB
Progress (1): 246/827 kB
Progress (1): 254/827 kB
Progress (1): 262/827 kB
Progress (1): 270/827 kB
Progress (1): 279/827 kB
Progress (1): 287/827 kB
Progress (1): 295/827 kB
Progress (1): 303/827 kB
Progress (1): 311/827 kB
Progress (1): 319/827 kB
Progress (1): 328/827 kB
Progress (1): 336/827 kB
Progress (1): 344/827 kB
Progress (1): 352/827 kB
Progress (1): 360/827 kB
Progress (1): 369/827 kB
Progress (1): 377/827 kB
Progress (1): 385/827 kB
Progress (1): 393/827 kB
Progress (1): 401/827 kB
Progress (1): 410/827 kB
Progress (1): 418/827 kB
Progress (1): 426/827 kB
Progress (1): 434/827 kB
Progress (1): 442/827 kB
Progress (1): 451/827 kB
Progress (1): 459/827 kB
Progress (1): 467/827 kB
Progress (1): 475/827 kB
Progress (1): 483/827 kB
Progress (1): 492/827 kB
Progress (1): 500/827 kB
Progress (1): 508/827 kB
Progress (1): 516/827 kB
Progress (1): 524/827 kB
Progress (1): 532/827 kB
Progress (1): 541/827 kB
Progress (1): 549/827 kB
Progress (1): 557/827 kB
Progress (1): 565/827 kB
Progress (1): 573/827 kB
Progress (1): 582/827 kB
Progress (1): 590/827 kB
Progress (1): 598/827 kB
Progress (1): 606/827 kB
Progress (1): 614/827 kB
Progress (1): 623/827 kB
Progress (1): 631/827 kB
Progress (1): 639/827 kB
Progress (1): 647/827 kB
Progress (1): 655/827 kB
Progress (1): 664/827 kB
Progress (1): 672/827 kB
Progress (1): 680/827 kB
Progress (1): 688/827 kB
Progress (1): 696/827 kB
Progress (1): 705/827 kB
Progress (1): 713/827 kB
Progress (1): 721/827 kB
Progress (1): 729/827 kB
Progress (1): 737/827 kB
Progress (1): 745/827 kB
Progress (1): 754/827 kB
Progress (1): 762/827 kB
Progress (1): 770/827 kB
Progress (1): 778/827 kB
Progress (1): 786/827 kB
Progress (1): 795/827 kB
Progress (1): 803/827 kB
Progress (1): 811/827 kB
Progress (1): 819/827 kB
Progress (1): 827 kB    
                    
Downloaded from central: https://repo.maven.apache.org/maven2/org/jbehave/jbehave-core/4.8.2/jbehave-core-4.8.2.jar (827 kB at 1.4 MB/s)
[INFO] 
[INFO] --- maven-clean-plugin:2.5:clean (default-clean) @ jbehave-junit-runner ---
[INFO] 
[INFO] --- maven-resources-plugin:2.6:resources (default-resources) @ jbehave-junit-runner ---
[INFO] Using 'UTF-8' encoding to copy filtered resources.
[INFO] skip non existing resourceDirectory /home/dspot/dspot_data/projects/codecentric_jbehave-junit-runner/src/src/main/resources
[INFO] 
[INFO] --- maven-compiler-plugin:3.8.1:compile (default-compile) @ jbehave-junit-runner ---
[INFO] Changes detected - recompiling the module!
[INFO] Compiling 6 source files to /home/dspot/dspot_data/projects/codecentric_jbehave-junit-runner/src/target/classes
[INFO] 
[INFO] --- maven-resources-plugin:2.6:testResources (default-testResources) @ jbehave-junit-runner ---
[INFO] Using 'UTF-8' encoding to copy filtered resources.
[INFO] Copying 14 resources
[INFO] 
[INFO] --- maven-compiler-plugin:3.8.1:testCompile (default-testCompile) @ jbehave-junit-runner ---
[INFO] Changes detected - recompiling the module!
[INFO] Compiling 19 source files to /home/dspot/dspot_data/projects/codecentric_jbehave-junit-runner/src/target/test-classes
[INFO] /home/dspot/dspot_data/projects/codecentric_jbehave-junit-runner/src/src/test/java/com/github/valfirst/jbehave/junit/monitoring/story/StoriesWithAllSortsOfBeforeAndAfter.java: /home/dspot/dspot_data/projects/codecentric_jbehave-junit-runner/src/src/test/java/com/github/valfirst/jbehave/junit/monitoring/story/StoriesWithAllSortsOfBeforeAndAfter.java uses or overrides a deprecated API.
[INFO] /home/dspot/dspot_data/projects/codecentric_jbehave-junit-runner/src/src/test/java/com/github/valfirst/jbehave/junit/monitoring/story/StoriesWithAllSortsOfBeforeAndAfter.java: Recompile with -Xlint:deprecation for details.
[INFO] 
[INFO] --- maven-surefire-plugin:2.12.4:test (default-test) @ jbehave-junit-runner ---
[INFO] Tests are skipped.
[INFO] 
[INFO] --- maven-surefire-plugin:2.12.4:test (integration-test-successful-stories) @ jbehave-junit-runner ---
[INFO] Tests are skipped.
[INFO] 
[INFO] --- maven-surefire-plugin:2.12.4:test (integration-test-failing-stories) @ jbehave-junit-runner ---
[INFO] Tests are skipped.
[INFO] 
[INFO] --- maven-jar-plugin:2.4:jar (default-jar) @ jbehave-junit-runner ---
[INFO] Building jar: /home/dspot/dspot_data/projects/codecentric_jbehave-junit-runner/src/target/jbehave-junit-runner-2.3.1-SNAPSHOT.jar
[INFO] 
[INFO] >>> maven-source-plugin:3.2.1:jar (attach-sources) > generate-sources @ jbehave-junit-runner >>>
[INFO] 
[INFO] <<< maven-source-plugin:3.2.1:jar (attach-sources) < generate-sources @ jbehave-junit-runner <<<
[INFO] 
[INFO] 
[INFO] --- maven-source-plugin:3.2.1:jar (attach-sources) @ jbehave-junit-runner ---
[INFO] Building jar: /home/dspot/dspot_data/projects/codecentric_jbehave-junit-runner/src/target/jbehave-junit-runner-2.3.1-SNAPSHOT-sources.jar
[INFO] 
[INFO] --- maven-javadoc-plugin:3.2.0:jar (attach-javadocs) @ jbehave-junit-runner ---
[INFO] No previous run data found, generating javadoc.
[INFO] 
Loading source files for package com.github.valfirst.jbehave.junit.monitoring...
Constructing Javadoc information...
Standard Doclet version 1.8.0_232
Building tree for all the packages and classes...
Generating /home/dspot/dspot_data/projects/codecentric_jbehave-junit-runner/src/target/apidocs/com/github/valfirst/jbehave/junit/monitoring/DescriptionTextUniquefier.html...
Generating /home/dspot/dspot_data/projects/codecentric_jbehave-junit-runner/src/target/apidocs/com/github/valfirst/jbehave/junit/monitoring/JUnitDescriptionGenerator.html...
Generating /home/dspot/dspot_data/projects/codecentric_jbehave-junit-runner/src/target/apidocs/com/github/valfirst/jbehave/junit/monitoring/JUnitReportingRunner.html...
Generating /home/dspot/dspot_data/projects/codecentric_jbehave-junit-runner/src/target/apidocs/com/github/valfirst/jbehave/junit/monitoring/JUnitScenarioReporter.html...
Generating /home/dspot/dspot_data/projects/codecentric_jbehave-junit-runner/src/target/apidocs/com/github/valfirst/jbehave/junit/monitoring/JUnitStringDecorator.html...
Generating /home/dspot/dspot_data/projects/codecentric_jbehave-junit-runner/src/target/apidocs/com/github/valfirst/jbehave/junit/monitoring/StoryPathsExtractor.html...
Generating /home/dspot/dspot_data/projects/codecentric_jbehave-junit-runner/src/target/apidocs/com/github/valfirst/jbehave/junit/monitoring/package-frame.html...
Generating /home/dspot/dspot_data/projects/codecentric_jbehave-junit-runner/src/target/apidocs/com/github/valfirst/jbehave/junit/monitoring/package-summary.html...
Generating /home/dspot/dspot_data/projects/codecentric_jbehave-junit-runner/src/target/apidocs/com/github/valfirst/jbehave/junit/monitoring/package-tree.html...
Generating /home/dspot/dspot_data/projects/codecentric_jbehave-junit-runner/src/target/apidocs/constant-values.html...
Generating /home/dspot/dspot_data/projects/codecentric_jbehave-junit-runner/src/target/apidocs/com/github/valfirst/jbehave/junit/monitoring/class-use/StoryPathsExtractor.html...
Generating /home/dspot/dspot_data/projects/codecentric_jbehave-junit-runner/src/target/apidocs/com/github/valfirst/jbehave/junit/monitoring/class-use/DescriptionTextUniquefier.html...
Generating /home/dspot/dspot_data/projects/codecentric_jbehave-junit-runner/src/target/apidocs/com/github/valfirst/jbehave/junit/monitoring/class-use/JUnitDescriptionGenerator.html...
Generating /home/dspot/dspot_data/projects/codecentric_jbehave-junit-runner/src/target/apidocs/com/github/valfirst/jbehave/junit/monitoring/class-use/JUnitReportingRunner.html...
Generating /home/dspot/dspot_data/projects/codecentric_jbehave-junit-runner/src/target/apidocs/com/github/valfirst/jbehave/junit/monitoring/class-use/JUnitScenarioReporter.html...
Generating /home/dspot/dspot_data/projects/codecentric_jbehave-junit-runner/src/target/apidocs/com/github/valfirst/jbehave/junit/monitoring/class-use/JUnitStringDecorator.html...
Generating /home/dspot/dspot_data/projects/codecentric_jbehave-junit-runner/src/target/apidocs/com/github/valfirst/jbehave/junit/monitoring/package-use.html...
Building index for all the packages and classes...
Generating /home/dspot/dspot_data/projects/codecentric_jbehave-junit-runner/src/target/apidocs/overview-tree.html...
Generating /home/dspot/dspot_data/projects/codecentric_jbehave-junit-runner/src/target/apidocs/index-all.html...
Generating /home/dspot/dspot_data/projects/codecentric_jbehave-junit-runner/src/target/apidocs/deprecated-list.html...
Building index for all classes...
Generating /home/dspot/dspot_data/projects/codecentric_jbehave-junit-runner/src/target/apidocs/allclasses-frame.html...
Generating /home/dspot/dspot_data/projects/codecentric_jbehave-junit-runner/src/target/apidocs/allclasses-noframe.html...
Generating /home/dspot/dspot_data/projects/codecentric_jbehave-junit-runner/src/target/apidocs/index.html...
Generating /home/dspot/dspot_data/projects/codecentric_jbehave-junit-runner/src/target/apidocs/help-doc.html...
[INFO] Building jar: /home/dspot/dspot_data/projects/codecentric_jbehave-junit-runner/src/target/jbehave-junit-runner-2.3.1-SNAPSHOT-javadoc.jar
[INFO] 
[INFO] --- maven-install-plugin:2.4:install (default-install) @ jbehave-junit-runner ---
[INFO] Installing /home/dspot/dspot_data/projects/codecentric_jbehave-junit-runner/src/target/jbehave-junit-runner-2.3.1-SNAPSHOT.jar to /home/dspot/.m2/repository/com/github/valfirst/jbehave-junit-runner/2.3.1-SNAPSHOT/jbehave-junit-runner-2.3.1-SNAPSHOT.jar
[INFO] Installing /home/dspot/dspot_data/projects/codecentric_jbehave-junit-runner/src/pom.xml to /home/dspot/.m2/repository/com/github/valfirst/jbehave-junit-runner/2.3.1-SNAPSHOT/jbehave-junit-runner-2.3.1-SNAPSHOT.pom
[INFO] Installing /home/dspot/dspot_data/projects/codecentric_jbehave-junit-runner/src/target/jbehave-junit-runner-2.3.1-SNAPSHOT-sources.jar to /home/dspot/.m2/repository/com/github/valfirst/jbehave-junit-runner/2.3.1-SNAPSHOT/jbehave-junit-runner-2.3.1-SNAPSHOT-sources.jar
[INFO] Installing /home/dspot/dspot_data/projects/codecentric_jbehave-junit-runner/src/target/jbehave-junit-runner-2.3.1-SNAPSHOT-javadoc.jar to /home/dspot/.m2/repository/com/github/valfirst/jbehave-junit-runner/2.3.1-SNAPSHOT/jbehave-junit-runner-2.3.1-SNAPSHOT-javadoc.jar
[INFO] ------------------------------------------------------------------------
[INFO] BUILD SUCCESS
[INFO] ------------------------------------------------------------------------
[INFO] Total time:  7.373 s
[INFO] Finished at: 2021-08-12T08:37:54Z
[INFO] ------------------------------------------------------------------------

DSpot execution

Analysis type / command used: MAVEN_HOME=/home/dspot/apache-maven-3.6.3/ /home/dspot/apache-maven-3.6.3/bin/mvn eu.stamp-project:dspot-maven:amplify-unit-tests -Doutput-path=../output/dspot

[INFO] Scanning for projects...
[WARNING] 
[WARNING] Some problems were encountered while building the effective model for com.github.valfirst:jbehave-junit-runner:jar:2.3.1-SNAPSHOT
[WARNING] 'build.plugins.plugin.version' for org.apache.maven.plugins:maven-surefire-plugin is missing. @ line 116, column 12
[WARNING] 
[WARNING] It is highly recommended to fix these problems because they threaten the stability of your build.
[WARNING] 
[WARNING] For this reason, future Maven versions might no longer support building such malformed projects.
[WARNING] 
[INFO] 
[INFO] --------------< com.github.valfirst:jbehave-junit-runner >--------------
[INFO] Building JBehave JUnit Runner 2.3.1-SNAPSHOT
[INFO] --------------------------------[ jar ]---------------------------------
[INFO] 
[INFO] --- dspot-maven:3.1.0:amplify-unit-tests (default-cli) @ jbehave-junit-runner ---
[INFO] Using /home/dspot/dspot_data/projects/codecentric_jbehave-junit-runner/src/pom.xml to run maven.
[INFO] Using /home/dspot/apache-maven-3.6.3 for maven home
[INFO] run maven: /home/dspot/apache-maven-3.6.3/bin/mvn clean test -DskipTests dependency:build-classpath -Dmdep.outputFile=target/dspot/classpath
[WARN] Maven will be executed in interactive mode, but no input stream has been configured for this MavenInvoker instance.
[INFO] Cache 'frameworkCache' created in EhcacheManager.
[INFO] Path to runner Classes: /home/dspot/.m2/repository/eu/stamp-project/test-runner/2.1.1/test-runner-2.1.1-jar-with-dependencies.jar
[INFO] /home/dspot/.m2/repository/org/jacoco/org.jacoco.core/0.7.9/org.jacoco.core-0.7.9.jar
[INFO] /home/dspot/.m2/repository/org/ow2/asm/asm-debug-all/5.2/asm-debug-all-5.2.jar
[INFO] /home/dspot/.m2/repository/eu/stamp-project/test-runner/2.1.1/test-runner-2.1.1-jar-with-dependencies.jar
[INFO] /home/dspot/.m2/repository/eu/stamp-project/test-runner/2.1.1/test-runner-2.1.1-jar-with-dependencies.jar
[INFO] /home/dspot/.m2/repository/eu/stamp-project/test-runner/2.1.1/test-runner-2.1.1-jar-with-dependencies.jar
[INFO] /home/dspot/.m2/repository/eu/stamp-project/test-runner/2.1.1/test-runner-2.1.1-jar-with-dependencies.jar
[INFO] /home/dspot/.m2/repository/eu/stamp-project/test-runner/2.1.1/test-runner-2.1.1-jar-with-dependencies.jar
[INFO] /home/dspot/.m2/repository/eu/stamp-project/test-runner/2.1.1/test-runner-2.1.1-jar-with-dependencies.jar
[INFO] /home/dspot/.m2/repository/eu/stamp-project/test-runner/2.1.1/test-runner-2.1.1-jar-with-dependencies.jar
[INFO] /home/dspot/.m2/repository/eu/stamp-project/test-runner/2.1.1/test-runner-2.1.1-jar-with-dependencies.jar
[INFO] Amplification of com.github.valfirst.jbehave.junit.monitoring.IgnoredTestsTest (1 test(s))
[INFO] Assertion amplification of com.github.valfirst.jbehave.junit.monitoring.IgnoredTestsTest (1 test(s))
[INFO] Using /home/dspot/dspot_data/projects/codecentric_jbehave-junit-runner/src//.dspot_pom.xml to run maven.
[INFO] Using /home/dspot/apache-maven-3.6.3 for maven home
[INFO] run maven: /home/dspot/apache-maven-3.6.3/bin/mvn org.pitest:pitest-maven:mutationCoverage 
[WARN] Maven will be executed in interactive mode, but no input stream has been configured for this MavenInvoker instance.
[ERROR] Something bad happened when DSpot tried to computed the original mutation score.
This is usually due to the value of the command line option --pit-filter-classes-to-keep.
Specify the filter of classes to keep used by PIT. This allow you restrict the scope of the mutation done by PIT. If this is not specified, DSpot will try to build on the fly a filter that takes into account the largest number of classes, e.g. the topest package. 
This is can be also due to a specific configuration of your test suite. If any test fails,
PIT (and so DSpot) won't be able to be executed. Please, check your environment variables,
external files, etc. You can use --excluded-classes and --excluded-test-cases
 to exclude respectively specific test classes ans test cases.
[WARNING] Something bad happened when DSpot tried to computed the original mutation score.
This is usually due to the value of the command line option --pit-filter-classes-to-keep.
Specify the filter of classes to keep used by PIT. This allow you restrict the scope of the mutation done by PIT. If this is not specified, DSpot will try to build on the fly a filter that takes into account the largest number of classes, e.g. the topest package. 
This is can be also due to a specific configuration of your test suite. If any test fails,
PIT (and so DSpot) won't be able to be executed. Please, check your environment variables,
external files, etc. You can use --excluded-classes and --excluded-test-cases
 to exclude respectively specific test classes ans test cases.
java.lang.RuntimeException: java.lang.RuntimeException: Maven build failed! Enable verbose mode for more information (--verbose)
	at eu.stamp_project.dspot.common.automaticbuilder.maven.MavenAutomaticBuilder.runPit(MavenAutomaticBuilder.java:155)
	at eu.stamp_project.dspot.common.automaticbuilder.maven.MavenAutomaticBuilder.runPit(MavenAutomaticBuilder.java:161)
	at eu.stamp_project.dspot.selector.PitMutantScoreSelector.init(PitMutantScoreSelector.java:109)
	at eu.stamp_project.dspot.common.configuration.AmplificationSetup.firstSelectorSetup(AmplificationSetup.java:124)
	at eu.stamp_project.dspot.DSpot.onlyAssertionGeneration(DSpot.java:72)
	at eu.stamp_project.dspot.DSpot.amplification(DSpot.java:61)
	at eu.stamp_project.dspot.DSpot.run(DSpot.java:53)
	at eu.stamp_project.Main.main(Main.java:20)
	at eu.stamp_project.DSpotMojo.execute(DSpotMojo.java:29)
	at org.apache.maven.plugin.DefaultBuildPluginManager.executeMojo(DefaultBuildPluginManager.java:137)
	at org.apache.maven.lifecycle.internal.MojoExecutor.execute(MojoExecutor.java:210)
	at org.apache.maven.lifecycle.internal.MojoExecutor.execute(MojoExecutor.java:156)
	at org.apache.maven.lifecycle.internal.MojoExecutor.execute(MojoExecutor.java:148)
	at org.apache.maven.lifecycle.internal.LifecycleModuleBuilder.buildProject(LifecycleModuleBuilder.java:117)
	at org.apache.maven.lifecycle.internal.LifecycleModuleBuilder.buildProject(LifecycleModuleBuilder.java:81)
	at org.apache.maven.lifecycle.internal.builder.singlethreaded.SingleThreadedBuilder.build(SingleThreadedBuilder.java:56)
	at org.apache.maven.lifecycle.internal.LifecycleStarter.execute(LifecycleStarter.java:128)
	at org.apache.maven.DefaultMaven.doExecute(DefaultMaven.java:305)
	at org.apache.maven.DefaultMaven.doExecute(DefaultMaven.java:192)
	at org.apache.maven.DefaultMaven.execute(DefaultMaven.java:105)
	at org.apache.maven.cli.MavenCli.execute(MavenCli.java:957)
	at org.apache.maven.cli.MavenCli.doMain(MavenCli.java:289)
	at org.apache.maven.cli.MavenCli.main(MavenCli.java:193)
	at sun.reflect.NativeMethodAccessorImpl.invoke0(Native Method)
	at sun.reflect.NativeMethodAccessorImpl.invoke(NativeMethodAccessorImpl.java:62)
	at sun.reflect.DelegatingMethodAccessorImpl.invoke(DelegatingMethodAccessorImpl.java:43)
	at java.lang.reflect.Method.invoke(Method.java:498)
	at org.codehaus.plexus.classworlds.launcher.Launcher.launchEnhanced(Launcher.java:282)
	at org.codehaus.plexus.classworlds.launcher.Launcher.launch(Launcher.java:225)
	at org.codehaus.plexus.classworlds.launcher.Launcher.mainWithExitCode(Launcher.java:406)
	at org.codehaus.plexus.classworlds.launcher.Launcher.main(Launcher.java:347)
Caused by: java.lang.RuntimeException: Maven build failed! Enable verbose mode for more information (--verbose)
	at eu.stamp_project.dspot.common.automaticbuilder.maven.MavenAutomaticBuilder.runPit(MavenAutomaticBuilder.java:152)
	... 30 more

[INFO] elapsedTime 4114
[ERROR] Something bad happened during the report fot test-criterion.
[ERROR] Dspot might not have output correctly!
[WARNING] DSpot could not obtain any amplified test method.
[WARNING] You can customize the following options: --amplifiers, --test-criterion, --iteration, --inputAmplDistributor etc, and retry with a new configuration.
[INFO] Amplification of com.github.valfirst.jbehave.junit.monitoring.JUnitDescriptionGeneratorTest (20 test(s))
[INFO] Assertion amplification of com.github.valfirst.jbehave.junit.monitoring.JUnitDescriptionGeneratorTest (20 test(s))
[INFO] Using /home/dspot/dspot_data/projects/codecentric_jbehave-junit-runner/src//.dspot_pom.xml to run maven.
[INFO] Using /home/dspot/apache-maven-3.6.3 for maven home
[INFO] run maven: /home/dspot/apache-maven-3.6.3/bin/mvn org.pitest:pitest-maven:mutationCoverage 
[WARN] Maven will be executed in interactive mode, but no input stream has been configured for this MavenInvoker instance.
[ERROR] Something bad happened when DSpot tried to computed the original mutation score.
This is usually due to the value of the command line option --pit-filter-classes-to-keep.
Specify the filter of classes to keep used by PIT. This allow you restrict the scope of the mutation done by PIT. If this is not specified, DSpot will try to build on the fly a filter that takes into account the largest number of classes, e.g. the topest package. 
This is can be also due to a specific configuration of your test suite. If any test fails,
PIT (and so DSpot) won't be able to be executed. Please, check your environment variables,
external files, etc. You can use --excluded-classes and --excluded-test-cases
 to exclude respectively specific test classes ans test cases.
[WARNING] Something bad happened when DSpot tried to computed the original mutation score.
This is usually due to the value of the command line option --pit-filter-classes-to-keep.
Specify the filter of classes to keep used by PIT. This allow you restrict the scope of the mutation done by PIT. If this is not specified, DSpot will try to build on the fly a filter that takes into account the largest number of classes, e.g. the topest package. 
This is can be also due to a specific configuration of your test suite. If any test fails,
PIT (and so DSpot) won't be able to be executed. Please, check your environment variables,
external files, etc. You can use --excluded-classes and --excluded-test-cases
 to exclude respectively specific test classes ans test cases.
java.lang.RuntimeException: java.lang.RuntimeException: Maven build failed! Enable verbose mode for more information (--verbose)
	at eu.stamp_project.dspot.common.automaticbuilder.maven.MavenAutomaticBuilder.runPit(MavenAutomaticBuilder.java:155)
	at eu.stamp_project.dspot.common.automaticbuilder.maven.MavenAutomaticBuilder.runPit(MavenAutomaticBuilder.java:161)
	at eu.stamp_project.dspot.selector.PitMutantScoreSelector.init(PitMutantScoreSelector.java:109)
	at eu.stamp_project.dspot.common.configuration.AmplificationSetup.firstSelectorSetup(AmplificationSetup.java:124)
	at eu.stamp_project.dspot.DSpot.onlyAssertionGeneration(DSpot.java:72)
	at eu.stamp_project.dspot.DSpot.amplification(DSpot.java:61)
	at eu.stamp_project.dspot.DSpot.run(DSpot.java:53)
	at eu.stamp_project.Main.main(Main.java:20)
	at eu.stamp_project.DSpotMojo.execute(DSpotMojo.java:29)
	at org.apache.maven.plugin.DefaultBuildPluginManager.executeMojo(DefaultBuildPluginManager.java:137)
	at org.apache.maven.lifecycle.internal.MojoExecutor.execute(MojoExecutor.java:210)
	at org.apache.maven.lifecycle.internal.MojoExecutor.execute(MojoExecutor.java:156)
	at org.apache.maven.lifecycle.internal.MojoExecutor.execute(MojoExecutor.java:148)
	at org.apache.maven.lifecycle.internal.LifecycleModuleBuilder.buildProject(LifecycleModuleBuilder.java:117)
	at org.apache.maven.lifecycle.internal.LifecycleModuleBuilder.buildProject(LifecycleModuleBuilder.java:81)
	at org.apache.maven.lifecycle.internal.builder.singlethreaded.SingleThreadedBuilder.build(SingleThreadedBuilder.java:56)
	at org.apache.maven.lifecycle.internal.LifecycleStarter.execute(LifecycleStarter.java:128)
	at org.apache.maven.DefaultMaven.doExecute(DefaultMaven.java:305)
	at org.apache.maven.DefaultMaven.doExecute(DefaultMaven.java:192)
	at org.apache.maven.DefaultMaven.execute(DefaultMaven.java:105)
	at org.apache.maven.cli.MavenCli.execute(MavenCli.java:957)
	at org.apache.maven.cli.MavenCli.doMain(MavenCli.java:289)
	at org.apache.maven.cli.MavenCli.main(MavenCli.java:193)
	at sun.reflect.NativeMethodAccessorImpl.invoke0(Native Method)
	at sun.reflect.NativeMethodAccessorImpl.invoke(NativeMethodAccessorImpl.java:62)
	at sun.reflect.DelegatingMethodAccessorImpl.invoke(DelegatingMethodAccessorImpl.java:43)
	at java.lang.reflect.Method.invoke(Method.java:498)
	at org.codehaus.plexus.classworlds.launcher.Launcher.launchEnhanced(Launcher.java:282)
	at org.codehaus.plexus.classworlds.launcher.Launcher.launch(Launcher.java:225)
	at org.codehaus.plexus.classworlds.launcher.Launcher.mainWithExitCode(Launcher.java:406)
	at org.codehaus.plexus.classworlds.launcher.Launcher.main(Launcher.java:347)
Caused by: java.lang.RuntimeException: Maven build failed! Enable verbose mode for more information (--verbose)
	at eu.stamp_project.dspot.common.automaticbuilder.maven.MavenAutomaticBuilder.runPit(MavenAutomaticBuilder.java:152)
	... 30 more

[INFO] elapsedTime 4052
[ERROR] Something bad happened during the report fot test-criterion.
[ERROR] Dspot might not have output correctly!
[WARNING] DSpot could not obtain any amplified test method.
[WARNING] You can customize the following options: --amplifiers, --test-criterion, --iteration, --inputAmplDistributor etc, and retry with a new configuration.
[INFO] Amplification of com.github.valfirst.jbehave.junit.monitoring.JUnitReportingRunnerIntegrationTest (5 test(s))
[INFO] Assertion amplification of com.github.valfirst.jbehave.junit.monitoring.JUnitReportingRunnerIntegrationTest (5 test(s))
[INFO] Using /home/dspot/dspot_data/projects/codecentric_jbehave-junit-runner/src//.dspot_pom.xml to run maven.
[INFO] Using /home/dspot/apache-maven-3.6.3 for maven home
[INFO] run maven: /home/dspot/apache-maven-3.6.3/bin/mvn org.pitest:pitest-maven:mutationCoverage 
[WARN] Maven will be executed in interactive mode, but no input stream has been configured for this MavenInvoker instance.
[ERROR] Something bad happened when DSpot tried to computed the original mutation score.
This is usually due to the value of the command line option --pit-filter-classes-to-keep.
Specify the filter of classes to keep used by PIT. This allow you restrict the scope of the mutation done by PIT. If this is not specified, DSpot will try to build on the fly a filter that takes into account the largest number of classes, e.g. the topest package. 
This is can be also due to a specific configuration of your test suite. If any test fails,
PIT (and so DSpot) won't be able to be executed. Please, check your environment variables,
external files, etc. You can use --excluded-classes and --excluded-test-cases
 to exclude respectively specific test classes ans test cases.
[WARNING] Something bad happened when DSpot tried to computed the original mutation score.
This is usually due to the value of the command line option --pit-filter-classes-to-keep.
Specify the filter of classes to keep used by PIT. This allow you restrict the scope of the mutation done by PIT. If this is not specified, DSpot will try to build on the fly a filter that takes into account the largest number of classes, e.g. the topest package. 
This is can be also due to a specific configuration of your test suite. If any test fails,
PIT (and so DSpot) won't be able to be executed. Please, check your environment variables,
external files, etc. You can use --excluded-classes and --excluded-test-cases
 to exclude respectively specific test classes ans test cases.
java.lang.RuntimeException: java.lang.RuntimeException: Maven build failed! Enable verbose mode for more information (--verbose)
	at eu.stamp_project.dspot.common.automaticbuilder.maven.MavenAutomaticBuilder.runPit(MavenAutomaticBuilder.java:155)
	at eu.stamp_project.dspot.common.automaticbuilder.maven.MavenAutomaticBuilder.runPit(MavenAutomaticBuilder.java:161)
	at eu.stamp_project.dspot.selector.PitMutantScoreSelector.init(PitMutantScoreSelector.java:109)
	at eu.stamp_project.dspot.common.configuration.AmplificationSetup.firstSelectorSetup(AmplificationSetup.java:124)
	at eu.stamp_project.dspot.DSpot.onlyAssertionGeneration(DSpot.java:72)
	at eu.stamp_project.dspot.DSpot.amplification(DSpot.java:61)
	at eu.stamp_project.dspot.DSpot.run(DSpot.java:53)
	at eu.stamp_project.Main.main(Main.java:20)
	at eu.stamp_project.DSpotMojo.execute(DSpotMojo.java:29)
	at org.apache.maven.plugin.DefaultBuildPluginManager.executeMojo(DefaultBuildPluginManager.java:137)
	at org.apache.maven.lifecycle.internal.MojoExecutor.execute(MojoExecutor.java:210)
	at org.apache.maven.lifecycle.internal.MojoExecutor.execute(MojoExecutor.java:156)
	at org.apache.maven.lifecycle.internal.MojoExecutor.execute(MojoExecutor.java:148)
	at org.apache.maven.lifecycle.internal.LifecycleModuleBuilder.buildProject(LifecycleModuleBuilder.java:117)
	at org.apache.maven.lifecycle.internal.LifecycleModuleBuilder.buildProject(LifecycleModuleBuilder.java:81)
	at org.apache.maven.lifecycle.internal.builder.singlethreaded.SingleThreadedBuilder.build(SingleThreadedBuilder.java:56)
	at org.apache.maven.lifecycle.internal.LifecycleStarter.execute(LifecycleStarter.java:128)
	at org.apache.maven.DefaultMaven.doExecute(DefaultMaven.java:305)
	at org.apache.maven.DefaultMaven.doExecute(DefaultMaven.java:192)
	at org.apache.maven.DefaultMaven.execute(DefaultMaven.java:105)
	at org.apache.maven.cli.MavenCli.execute(MavenCli.java:957)
	at org.apache.maven.cli.MavenCli.doMain(MavenCli.java:289)
	at org.apache.maven.cli.MavenCli.main(MavenCli.java:193)
	at sun.reflect.NativeMethodAccessorImpl.invoke0(Native Method)
	at sun.reflect.NativeMethodAccessorImpl.invoke(NativeMethodAccessorImpl.java:62)
	at sun.reflect.DelegatingMethodAccessorImpl.invoke(DelegatingMethodAccessorImpl.java:43)
	at java.lang.reflect.Method.invoke(Method.java:498)
	at org.codehaus.plexus.classworlds.launcher.Launcher.launchEnhanced(Launcher.java:282)
	at org.codehaus.plexus.classworlds.launcher.Launcher.launch(Launcher.java:225)
	at org.codehaus.plexus.classworlds.launcher.Launcher.mainWithExitCode(Launcher.java:406)
	at org.codehaus.plexus.classworlds.launcher.Launcher.main(Launcher.java:347)
Caused by: java.lang.RuntimeException: Maven build failed! Enable verbose mode for more information (--verbose)
	at eu.stamp_project.dspot.common.automaticbuilder.maven.MavenAutomaticBuilder.runPit(MavenAutomaticBuilder.java:152)
	... 30 more

[INFO] elapsedTime 3932
[ERROR] Something bad happened during the report fot test-criterion.
[ERROR] Dspot might not have output correctly!
[WARNING] DSpot could not obtain any amplified test method.
[WARNING] You can customize the following options: --amplifiers, --test-criterion, --iteration, --inputAmplDistributor etc, and retry with a new configuration.
[INFO] Amplification of com.github.valfirst.jbehave.junit.monitoring.JUnitReportingRunnerTest (1 test(s))
[INFO] Assertion amplification of com.github.valfirst.jbehave.junit.monitoring.JUnitReportingRunnerTest (1 test(s))
[INFO] Using /home/dspot/dspot_data/projects/codecentric_jbehave-junit-runner/src//.dspot_pom.xml to run maven.
[INFO] Using /home/dspot/apache-maven-3.6.3 for maven home
[INFO] run maven: /home/dspot/apache-maven-3.6.3/bin/mvn org.pitest:pitest-maven:mutationCoverage 
[WARN] Maven will be executed in interactive mode, but no input stream has been configured for this MavenInvoker instance.
[ERROR] Something bad happened when DSpot tried to computed the original mutation score.
This is usually due to the value of the command line option --pit-filter-classes-to-keep.
Specify the filter of classes to keep used by PIT. This allow you restrict the scope of the mutation done by PIT. If this is not specified, DSpot will try to build on the fly a filter that takes into account the largest number of classes, e.g. the topest package. 
This is can be also due to a specific configuration of your test suite. If any test fails,
PIT (and so DSpot) won't be able to be executed. Please, check your environment variables,
external files, etc. You can use --excluded-classes and --excluded-test-cases
 to exclude respectively specific test classes ans test cases.
[WARNING] Something bad happened when DSpot tried to computed the original mutation score.
This is usually due to the value of the command line option --pit-filter-classes-to-keep.
Specify the filter of classes to keep used by PIT. This allow you restrict the scope of the mutation done by PIT. If this is not specified, DSpot will try to build on the fly a filter that takes into account the largest number of classes, e.g. the topest package. 
This is can be also due to a specific configuration of your test suite. If any test fails,
PIT (and so DSpot) won't be able to be executed. Please, check your environment variables,
external files, etc. You can use --excluded-classes and --excluded-test-cases
 to exclude respectively specific test classes ans test cases.
java.lang.RuntimeException: java.lang.RuntimeException: Maven build failed! Enable verbose mode for more information (--verbose)
	at eu.stamp_project.dspot.common.automaticbuilder.maven.MavenAutomaticBuilder.runPit(MavenAutomaticBuilder.java:155)
	at eu.stamp_project.dspot.common.automaticbuilder.maven.MavenAutomaticBuilder.runPit(MavenAutomaticBuilder.java:161)
	at eu.stamp_project.dspot.selector.PitMutantScoreSelector.init(PitMutantScoreSelector.java:109)
	at eu.stamp_project.dspot.common.configuration.AmplificationSetup.firstSelectorSetup(AmplificationSetup.java:124)
	at eu.stamp_project.dspot.DSpot.onlyAssertionGeneration(DSpot.java:72)
	at eu.stamp_project.dspot.DSpot.amplification(DSpot.java:61)
	at eu.stamp_project.dspot.DSpot.run(DSpot.java:53)
	at eu.stamp_project.Main.main(Main.java:20)
	at eu.stamp_project.DSpotMojo.execute(DSpotMojo.java:29)
	at org.apache.maven.plugin.DefaultBuildPluginManager.executeMojo(DefaultBuildPluginManager.java:137)
	at org.apache.maven.lifecycle.internal.MojoExecutor.execute(MojoExecutor.java:210)
	at org.apache.maven.lifecycle.internal.MojoExecutor.execute(MojoExecutor.java:156)
	at org.apache.maven.lifecycle.internal.MojoExecutor.execute(MojoExecutor.java:148)
	at org.apache.maven.lifecycle.internal.LifecycleModuleBuilder.buildProject(LifecycleModuleBuilder.java:117)
	at org.apache.maven.lifecycle.internal.LifecycleModuleBuilder.buildProject(LifecycleModuleBuilder.java:81)
	at org.apache.maven.lifecycle.internal.builder.singlethreaded.SingleThreadedBuilder.build(SingleThreadedBuilder.java:56)
	at org.apache.maven.lifecycle.internal.LifecycleStarter.execute(LifecycleStarter.java:128)
	at org.apache.maven.DefaultMaven.doExecute(DefaultMaven.java:305)
	at org.apache.maven.DefaultMaven.doExecute(DefaultMaven.java:192)
	at org.apache.maven.DefaultMaven.execute(DefaultMaven.java:105)
	at org.apache.maven.cli.MavenCli.execute(MavenCli.java:957)
	at org.apache.maven.cli.MavenCli.doMain(MavenCli.java:289)
	at org.apache.maven.cli.MavenCli.main(MavenCli.java:193)
	at sun.reflect.NativeMethodAccessorImpl.invoke0(Native Method)
	at sun.reflect.NativeMethodAccessorImpl.invoke(NativeMethodAccessorImpl.java:62)
	at sun.reflect.DelegatingMethodAccessorImpl.invoke(DelegatingMethodAccessorImpl.java:43)
	at java.lang.reflect.Method.invoke(Method.java:498)
	at org.codehaus.plexus.classworlds.launcher.Launcher.launchEnhanced(Launcher.java:282)
	at org.codehaus.plexus.classworlds.launcher.Launcher.launch(Launcher.java:225)
	at org.codehaus.plexus.classworlds.launcher.Launcher.mainWithExitCode(Launcher.java:406)
	at org.codehaus.plexus.classworlds.launcher.Launcher.main(Launcher.java:347)
Caused by: java.lang.RuntimeException: Maven build failed! Enable verbose mode for more information (--verbose)
	at eu.stamp_project.dspot.common.automaticbuilder.maven.MavenAutomaticBuilder.runPit(MavenAutomaticBuilder.java:152)
	... 30 more

[INFO] elapsedTime 3611
[ERROR] Something bad happened during the report fot test-criterion.
[ERROR] Dspot might not have output correctly!
[WARNING] DSpot could not obtain any amplified test method.
[WARNING] You can customize the following options: --amplifiers, --test-criterion, --iteration, --inputAmplDistributor etc, and retry with a new configuration.
[INFO] Amplification of com.github.valfirst.jbehave.junit.monitoring.JUnitScenarioReporterTest (20 test(s))
[INFO] Assertion amplification of com.github.valfirst.jbehave.junit.monitoring.JUnitScenarioReporterTest (20 test(s))
[INFO] Using /home/dspot/dspot_data/projects/codecentric_jbehave-junit-runner/src//.dspot_pom.xml to run maven.
[INFO] Using /home/dspot/apache-maven-3.6.3 for maven home
[INFO] run maven: /home/dspot/apache-maven-3.6.3/bin/mvn org.pitest:pitest-maven:mutationCoverage 
[WARN] Maven will be executed in interactive mode, but no input stream has been configured for this MavenInvoker instance.
[ERROR] Something bad happened when DSpot tried to computed the original mutation score.
This is usually due to the value of the command line option --pit-filter-classes-to-keep.
Specify the filter of classes to keep used by PIT. This allow you restrict the scope of the mutation done by PIT. If this is not specified, DSpot will try to build on the fly a filter that takes into account the largest number of classes, e.g. the topest package. 
This is can be also due to a specific configuration of your test suite. If any test fails,
PIT (and so DSpot) won't be able to be executed. Please, check your environment variables,
external files, etc. You can use --excluded-classes and --excluded-test-cases
 to exclude respectively specific test classes ans test cases.
[WARNING] Something bad happened when DSpot tried to computed the original mutation score.
This is usually due to the value of the command line option --pit-filter-classes-to-keep.
Specify the filter of classes to keep used by PIT. This allow you restrict the scope of the mutation done by PIT. If this is not specified, DSpot will try to build on the fly a filter that takes into account the largest number of classes, e.g. the topest package. 
This is can be also due to a specific configuration of your test suite. If any test fails,
PIT (and so DSpot) won't be able to be executed. Please, check your environment variables,
external files, etc. You can use --excluded-classes and --excluded-test-cases
 to exclude respectively specific test classes ans test cases.
java.lang.RuntimeException: java.lang.RuntimeException: Maven build failed! Enable verbose mode for more information (--verbose)
	at eu.stamp_project.dspot.common.automaticbuilder.maven.MavenAutomaticBuilder.runPit(MavenAutomaticBuilder.java:155)
	at eu.stamp_project.dspot.common.automaticbuilder.maven.MavenAutomaticBuilder.runPit(MavenAutomaticBuilder.java:161)
	at eu.stamp_project.dspot.selector.PitMutantScoreSelector.init(PitMutantScoreSelector.java:109)
	at eu.stamp_project.dspot.common.configuration.AmplificationSetup.firstSelectorSetup(AmplificationSetup.java:124)
	at eu.stamp_project.dspot.DSpot.onlyAssertionGeneration(DSpot.java:72)
	at eu.stamp_project.dspot.DSpot.amplification(DSpot.java:61)
	at eu.stamp_project.dspot.DSpot.run(DSpot.java:53)
	at eu.stamp_project.Main.main(Main.java:20)
	at eu.stamp_project.DSpotMojo.execute(DSpotMojo.java:29)
	at org.apache.maven.plugin.DefaultBuildPluginManager.executeMojo(DefaultBuildPluginManager.java:137)
	at org.apache.maven.lifecycle.internal.MojoExecutor.execute(MojoExecutor.java:210)
	at org.apache.maven.lifecycle.internal.MojoExecutor.execute(MojoExecutor.java:156)
	at org.apache.maven.lifecycle.internal.MojoExecutor.execute(MojoExecutor.java:148)
	at org.apache.maven.lifecycle.internal.LifecycleModuleBuilder.buildProject(LifecycleModuleBuilder.java:117)
	at org.apache.maven.lifecycle.internal.LifecycleModuleBuilder.buildProject(LifecycleModuleBuilder.java:81)
	at org.apache.maven.lifecycle.internal.builder.singlethreaded.SingleThreadedBuilder.build(SingleThreadedBuilder.java:56)
	at org.apache.maven.lifecycle.internal.LifecycleStarter.execute(LifecycleStarter.java:128)
	at org.apache.maven.DefaultMaven.doExecute(DefaultMaven.java:305)
	at org.apache.maven.DefaultMaven.doExecute(DefaultMaven.java:192)
	at org.apache.maven.DefaultMaven.execute(DefaultMaven.java:105)
	at org.apache.maven.cli.MavenCli.execute(MavenCli.java:957)
	at org.apache.maven.cli.MavenCli.doMain(MavenCli.java:289)
	at org.apache.maven.cli.MavenCli.main(MavenCli.java:193)
	at sun.reflect.NativeMethodAccessorImpl.invoke0(Native Method)
	at sun.reflect.NativeMethodAccessorImpl.invoke(NativeMethodAccessorImpl.java:62)
	at sun.reflect.DelegatingMethodAccessorImpl.invoke(DelegatingMethodAccessorImpl.java:43)
	at java.lang.reflect.Method.invoke(Method.java:498)
	at org.codehaus.plexus.classworlds.launcher.Launcher.launchEnhanced(Launcher.java:282)
	at org.codehaus.plexus.classworlds.launcher.Launcher.launch(Launcher.java:225)
	at org.codehaus.plexus.classworlds.launcher.Launcher.mainWithExitCode(Launcher.java:406)
	at org.codehaus.plexus.classworlds.launcher.Launcher.main(Launcher.java:347)
Caused by: java.lang.RuntimeException: Maven build failed! Enable verbose mode for more information (--verbose)
	at eu.stamp_project.dspot.common.automaticbuilder.maven.MavenAutomaticBuilder.runPit(MavenAutomaticBuilder.java:152)
	... 30 more

[INFO] elapsedTime 3853
[ERROR] Something bad happened during the report fot test-criterion.
[ERROR] Dspot might not have output correctly!
[WARNING] DSpot could not obtain any amplified test method.
[WARNING] You can customize the following options: --amplifiers, --test-criterion, --iteration, --inputAmplDistributor etc, and retry with a new configuration.
[INFO] Amplification of com.github.valfirst.jbehave.junit.monitoring.JUnitStringDecoratorTest (3 test(s))
[INFO] Assertion amplification of com.github.valfirst.jbehave.junit.monitoring.JUnitStringDecoratorTest (3 test(s))
[INFO] Using /home/dspot/dspot_data/projects/codecentric_jbehave-junit-runner/src//.dspot_pom.xml to run maven.
[INFO] Using /home/dspot/apache-maven-3.6.3 for maven home
[INFO] run maven: /home/dspot/apache-maven-3.6.3/bin/mvn org.pitest:pitest-maven:mutationCoverage 
[WARN] Maven will be executed in interactive mode, but no input stream has been configured for this MavenInvoker instance.
[ERROR] Something bad happened when DSpot tried to computed the original mutation score.
This is usually due to the value of the command line option --pit-filter-classes-to-keep.
Specify the filter of classes to keep used by PIT. This allow you restrict the scope of the mutation done by PIT. If this is not specified, DSpot will try to build on the fly a filter that takes into account the largest number of classes, e.g. the topest package. 
This is can be also due to a specific configuration of your test suite. If any test fails,
PIT (and so DSpot) won't be able to be executed. Please, check your environment variables,
external files, etc. You can use --excluded-classes and --excluded-test-cases
 to exclude respectively specific test classes ans test cases.
[WARNING] Something bad happened when DSpot tried to computed the original mutation score.
This is usually due to the value of the command line option --pit-filter-classes-to-keep.
Specify the filter of classes to keep used by PIT. This allow you restrict the scope of the mutation done by PIT. If this is not specified, DSpot will try to build on the fly a filter that takes into account the largest number of classes, e.g. the topest package. 
This is can be also due to a specific configuration of your test suite. If any test fails,
PIT (and so DSpot) won't be able to be executed. Please, check your environment variables,
external files, etc. You can use --excluded-classes and --excluded-test-cases
 to exclude respectively specific test classes ans test cases.
java.lang.RuntimeException: java.lang.RuntimeException: Maven build failed! Enable verbose mode for more information (--verbose)
	at eu.stamp_project.dspot.common.automaticbuilder.maven.MavenAutomaticBuilder.runPit(MavenAutomaticBuilder.java:155)
	at eu.stamp_project.dspot.common.automaticbuilder.maven.MavenAutomaticBuilder.runPit(MavenAutomaticBuilder.java:161)
	at eu.stamp_project.dspot.selector.PitMutantScoreSelector.init(PitMutantScoreSelector.java:109)
	at eu.stamp_project.dspot.common.configuration.AmplificationSetup.firstSelectorSetup(AmplificationSetup.java:124)
	at eu.stamp_project.dspot.DSpot.onlyAssertionGeneration(DSpot.java:72)
	at eu.stamp_project.dspot.DSpot.amplification(DSpot.java:61)
	at eu.stamp_project.dspot.DSpot.run(DSpot.java:53)
	at eu.stamp_project.Main.main(Main.java:20)
	at eu.stamp_project.DSpotMojo.execute(DSpotMojo.java:29)
	at org.apache.maven.plugin.DefaultBuildPluginManager.executeMojo(DefaultBuildPluginManager.java:137)
	at org.apache.maven.lifecycle.internal.MojoExecutor.execute(MojoExecutor.java:210)
	at org.apache.maven.lifecycle.internal.MojoExecutor.execute(MojoExecutor.java:156)
	at org.apache.maven.lifecycle.internal.MojoExecutor.execute(MojoExecutor.java:148)
	at org.apache.maven.lifecycle.internal.LifecycleModuleBuilder.buildProject(LifecycleModuleBuilder.java:117)
	at org.apache.maven.lifecycle.internal.LifecycleModuleBuilder.buildProject(LifecycleModuleBuilder.java:81)
	at org.apache.maven.lifecycle.internal.builder.singlethreaded.SingleThreadedBuilder.build(SingleThreadedBuilder.java:56)
	at org.apache.maven.lifecycle.internal.LifecycleStarter.execute(LifecycleStarter.java:128)
	at org.apache.maven.DefaultMaven.doExecute(DefaultMaven.java:305)
	at org.apache.maven.DefaultMaven.doExecute(DefaultMaven.java:192)
	at org.apache.maven.DefaultMaven.execute(DefaultMaven.java:105)
	at org.apache.maven.cli.MavenCli.execute(MavenCli.java:957)
	at org.apache.maven.cli.MavenCli.doMain(MavenCli.java:289)
	at org.apache.maven.cli.MavenCli.main(MavenCli.java:193)
	at sun.reflect.NativeMethodAccessorImpl.invoke0(Native Method)
	at sun.reflect.NativeMethodAccessorImpl.invoke(NativeMethodAccessorImpl.java:62)
	at sun.reflect.DelegatingMethodAccessorImpl.invoke(DelegatingMethodAccessorImpl.java:43)
	at java.lang.reflect.Method.invoke(Method.java:498)
	at org.codehaus.plexus.classworlds.launcher.Launcher.launchEnhanced(Launcher.java:282)
	at org.codehaus.plexus.classworlds.launcher.Launcher.launch(Launcher.java:225)
	at org.codehaus.plexus.classworlds.launcher.Launcher.mainWithExitCode(Launcher.java:406)
	at org.codehaus.plexus.classworlds.launcher.Launcher.main(Launcher.java:347)
Caused by: java.lang.RuntimeException: Maven build failed! Enable verbose mode for more information (--verbose)
	at eu.stamp_project.dspot.common.automaticbuilder.maven.MavenAutomaticBuilder.runPit(MavenAutomaticBuilder.java:152)
	... 30 more

[INFO] elapsedTime 4279
[ERROR] Something bad happened during the report fot test-criterion.
[ERROR] Dspot might not have output correctly!
[WARNING] DSpot could not obtain any amplified test method.
[WARNING] You can customize the following options: --amplifiers, --test-criterion, --iteration, --inputAmplDistributor etc, and retry with a new configuration.
[INFO] Amplification of com.github.valfirst.jbehave.junit.monitoring.StoryPathsExtractorTest (4 test(s))
[INFO] Assertion amplification of com.github.valfirst.jbehave.junit.monitoring.StoryPathsExtractorTest (4 test(s))
[INFO] Using /home/dspot/dspot_data/projects/codecentric_jbehave-junit-runner/src//.dspot_pom.xml to run maven.
[INFO] Using /home/dspot/apache-maven-3.6.3 for maven home
[INFO] run maven: /home/dspot/apache-maven-3.6.3/bin/mvn org.pitest:pitest-maven:mutationCoverage 
[WARN] Maven will be executed in interactive mode, but no input stream has been configured for this MavenInvoker instance.
[ERROR] Something bad happened when DSpot tried to computed the original mutation score.
This is usually due to the value of the command line option --pit-filter-classes-to-keep.
Specify the filter of classes to keep used by PIT. This allow you restrict the scope of the mutation done by PIT. If this is not specified, DSpot will try to build on the fly a filter that takes into account the largest number of classes, e.g. the topest package. 
This is can be also due to a specific configuration of your test suite. If any test fails,
PIT (and so DSpot) won't be able to be executed. Please, check your environment variables,
external files, etc. You can use --excluded-classes and --excluded-test-cases
 to exclude respectively specific test classes ans test cases.
[WARNING] Something bad happened when DSpot tried to computed the original mutation score.
This is usually due to the value of the command line option --pit-filter-classes-to-keep.
Specify the filter of classes to keep used by PIT. This allow you restrict the scope of the mutation done by PIT. If this is not specified, DSpot will try to build on the fly a filter that takes into account the largest number of classes, e.g. the topest package. 
This is can be also due to a specific configuration of your test suite. If any test fails,
PIT (and so DSpot) won't be able to be executed. Please, check your environment variables,
external files, etc. You can use --excluded-classes and --excluded-test-cases
 to exclude respectively specific test classes ans test cases.
java.lang.RuntimeException: java.lang.RuntimeException: Maven build failed! Enable verbose mode for more information (--verbose)
	at eu.stamp_project.dspot.common.automaticbuilder.maven.MavenAutomaticBuilder.runPit(MavenAutomaticBuilder.java:155)
	at eu.stamp_project.dspot.common.automaticbuilder.maven.MavenAutomaticBuilder.runPit(MavenAutomaticBuilder.java:161)
	at eu.stamp_project.dspot.selector.PitMutantScoreSelector.init(PitMutantScoreSelector.java:109)
	at eu.stamp_project.dspot.common.configuration.AmplificationSetup.firstSelectorSetup(AmplificationSetup.java:124)
	at eu.stamp_project.dspot.DSpot.onlyAssertionGeneration(DSpot.java:72)
	at eu.stamp_project.dspot.DSpot.amplification(DSpot.java:61)
	at eu.stamp_project.dspot.DSpot.run(DSpot.java:53)
	at eu.stamp_project.Main.main(Main.java:20)
	at eu.stamp_project.DSpotMojo.execute(DSpotMojo.java:29)
	at org.apache.maven.plugin.DefaultBuildPluginManager.executeMojo(DefaultBuildPluginManager.java:137)
	at org.apache.maven.lifecycle.internal.MojoExecutor.execute(MojoExecutor.java:210)
	at org.apache.maven.lifecycle.internal.MojoExecutor.execute(MojoExecutor.java:156)
	at org.apache.maven.lifecycle.internal.MojoExecutor.execute(MojoExecutor.java:148)
	at org.apache.maven.lifecycle.internal.LifecycleModuleBuilder.buildProject(LifecycleModuleBuilder.java:117)
	at org.apache.maven.lifecycle.internal.LifecycleModuleBuilder.buildProject(LifecycleModuleBuilder.java:81)
	at org.apache.maven.lifecycle.internal.builder.singlethreaded.SingleThreadedBuilder.build(SingleThreadedBuilder.java:56)
	at org.apache.maven.lifecycle.internal.LifecycleStarter.execute(LifecycleStarter.java:128)
	at org.apache.maven.DefaultMaven.doExecute(DefaultMaven.java:305)
	at org.apache.maven.DefaultMaven.doExecute(DefaultMaven.java:192)
	at org.apache.maven.DefaultMaven.execute(DefaultMaven.java:105)
	at org.apache.maven.cli.MavenCli.execute(MavenCli.java:957)
	at org.apache.maven.cli.MavenCli.doMain(MavenCli.java:289)
	at org.apache.maven.cli.MavenCli.main(MavenCli.java:193)
	at sun.reflect.NativeMethodAccessorImpl.invoke0(Native Method)
	at sun.reflect.NativeMethodAccessorImpl.invoke(NativeMethodAccessorImpl.java:62)
	at sun.reflect.DelegatingMethodAccessorImpl.invoke(DelegatingMethodAccessorImpl.java:43)
	at java.lang.reflect.Method.invoke(Method.java:498)
	at org.codehaus.plexus.classworlds.launcher.Launcher.launchEnhanced(Launcher.java:282)
	at org.codehaus.plexus.classworlds.launcher.Launcher.launch(Launcher.java:225)
	at org.codehaus.plexus.classworlds.launcher.Launcher.mainWithExitCode(Launcher.java:406)
	at org.codehaus.plexus.classworlds.launcher.Launcher.main(Launcher.java:347)
Caused by: java.lang.RuntimeException: Maven build failed! Enable verbose mode for more information (--verbose)
	at eu.stamp_project.dspot.common.automaticbuilder.maven.MavenAutomaticBuilder.runPit(MavenAutomaticBuilder.java:152)
	... 30 more

[INFO] elapsedTime 3938
[ERROR] Something bad happened during the report fot test-criterion.
[ERROR] Dspot might not have output correctly!
[WARNING] DSpot could not obtain any amplified test method.
[WARNING] You can customize the following options: --amplifiers, --test-criterion, --iteration, --inputAmplDistributor etc, and retry with a new configuration.
[INFO] Amplification succeed.
[INFO] Elapsed time 36641 ms
[INFO] 

[INFO] Writing report in ../output/dspot/report.txt
[WARNING] DSpot encountered some errors during amplification.
[WARNING] DSpot encountered 7 error(s) during amplification.
Something bad happened when DSpot tried to computed the original mutation score.
This is usually due to the value of the command line option --pit-filter-classes-to-keep.
Specify the filter of classes to keep used by PIT. This allow you restrict the scope of the mutation done by PIT. If this is not specified, DSpot will try to build on the fly a filter that takes into account the largest number of classes, e.g. the topest package. 
This is can be also due to a specific configuration of your test suite. If any test fails,
PIT (and so DSpot) won't be able to be executed. Please, check your environment variables,
external files, etc. You can use --excluded-classes and --excluded-test-cases
 to exclude respectively specific test classes ans test cases.
java.lang.RuntimeException: java.lang.RuntimeException: Maven build failed! Enable verbose mode for more information (--verbose)
	at eu.stamp_project.dspot.common.automaticbuilder.maven.MavenAutomaticBuilder.runPit(MavenAutomaticBuilder.java:155)
	at eu.stamp_project.dspot.common.automaticbuilder.maven.MavenAutomaticBuilder.runPit(MavenAutomaticBuilder.java:161)
	at eu.stamp_project.dspot.selector.PitMutantScoreSelector.init(PitMutantScoreSelector.java:109)
	at eu.stamp_project.dspot.common.configuration.AmplificationSetup.firstSelectorSetup(AmplificationSetup.java:124)
	at eu.stamp_project.dspot.DSpot.onlyAssertionGeneration(DSpot.java:72)
	at eu.stamp_project.dspot.DSpot.amplification(DSpot.java:61)
	at eu.stamp_project.dspot.DSpot.run(DSpot.java:53)
	at eu.stamp_project.Main.main(Main.java:20)
	at eu.stamp_project.DSpotMojo.execute(DSpotMojo.java:29)
	at org.apache.maven.plugin.DefaultBuildPluginManager.executeMojo(DefaultBuildPluginManager.java:137)
	at org.apache.maven.lifecycle.internal.MojoExecutor.execute(MojoExecutor.java:210)
	at org.apache.maven.lifecycle.internal.MojoExecutor.execute(MojoExecutor.java:156)
	at org.apache.maven.lifecycle.internal.MojoExecutor.execute(MojoExecutor.java:148)
	at org.apache.maven.lifecycle.internal.LifecycleModuleBuilder.buildProject(LifecycleModuleBuilder.java:117)
	at org.apache.maven.lifecycle.internal.LifecycleModuleBuilder.buildProject(LifecycleModuleBuilder.java:81)
	at org.apache.maven.lifecycle.internal.builder.singlethreaded.SingleThreadedBuilder.build(SingleThreadedBuilder.java:56)
	at org.apache.maven.lifecycle.internal.LifecycleStarter.execute(LifecycleStarter.java:128)
	at org.apache.maven.DefaultMaven.doExecute(DefaultMaven.java:305)
	at org.apache.maven.DefaultMaven.doExecute(DefaultMaven.java:192)
	at org.apache.maven.DefaultMaven.execute(DefaultMaven.java:105)
	at org.apache.maven.cli.MavenCli.execute(MavenCli.java:957)
	at org.apache.maven.cli.MavenCli.doMain(MavenCli.java:289)
	at org.apache.maven.cli.MavenCli.main(MavenCli.java:193)
	at sun.reflect.NativeMethodAccessorImpl.invoke0(Native Method)
	at sun.reflect.NativeMethodAccessorImpl.invoke(NativeMethodAccessorImpl.java:62)
	at sun.reflect.DelegatingMethodAccessorImpl.invoke(DelegatingMethodAccessorImpl.java:43)
	at java.lang.reflect.Method.invoke(Method.java:498)
	at org.codehaus.plexus.classworlds.launcher.Launcher.launchEnhanced(Launcher.java:282)
	at org.codehaus.plexus.classworlds.launcher.Launcher.launch(Launcher.java:225)
	at org.codehaus.plexus.classworlds.launcher.Launcher.mainWithExitCode(Launcher.java:406)
	at org.codehaus.plexus.classworlds.launcher.Launcher.main(Launcher.java:347)
Caused by: java.lang.RuntimeException: Maven build failed! Enable verbose mode for more information (--verbose)
	at eu.stamp_project.dspot.common.automaticbuilder.maven.MavenAutomaticBuilder.runPit(MavenAutomaticBuilder.java:152)
	... 30 more

Something bad happened when DSpot tried to computed the original mutation score.
This is usually due to the value of the command line option --pit-filter-classes-to-keep.
Specify the filter of classes to keep used by PIT. This allow you restrict the scope of the mutation done by PIT. If this is not specified, DSpot will try to build on the fly a filter that takes into account the largest number of classes, e.g. the topest package. 
This is can be also due to a specific configuration of your test suite. If any test fails,
PIT (and so DSpot) won't be able to be executed. Please, check your environment variables,
external files, etc. You can use --excluded-classes and --excluded-test-cases
 to exclude respectively specific test classes ans test cases.
java.lang.RuntimeException: java.lang.RuntimeException: Maven build failed! Enable verbose mode for more information (--verbose)
	at eu.stamp_project.dspot.common.automaticbuilder.maven.MavenAutomaticBuilder.runPit(MavenAutomaticBuilder.java:155)
	at eu.stamp_project.dspot.common.automaticbuilder.maven.MavenAutomaticBuilder.runPit(MavenAutomaticBuilder.java:161)
	at eu.stamp_project.dspot.selector.PitMutantScoreSelector.init(PitMutantScoreSelector.java:109)
	at eu.stamp_project.dspot.common.configuration.AmplificationSetup.firstSelectorSetup(AmplificationSetup.java:124)
	at eu.stamp_project.dspot.DSpot.onlyAssertionGeneration(DSpot.java:72)
	at eu.stamp_project.dspot.DSpot.amplification(DSpot.java:61)
	at eu.stamp_project.dspot.DSpot.run(DSpot.java:53)
	at eu.stamp_project.Main.main(Main.java:20)
	at eu.stamp_project.DSpotMojo.execute(DSpotMojo.java:29)
	at org.apache.maven.plugin.DefaultBuildPluginManager.executeMojo(DefaultBuildPluginManager.java:137)
	at org.apache.maven.lifecycle.internal.MojoExecutor.execute(MojoExecutor.java:210)
	at org.apache.maven.lifecycle.internal.MojoExecutor.execute(MojoExecutor.java:156)
	at org.apache.maven.lifecycle.internal.MojoExecutor.execute(MojoExecutor.java:148)
	at org.apache.maven.lifecycle.internal.LifecycleModuleBuilder.buildProject(LifecycleModuleBuilder.java:117)
	at org.apache.maven.lifecycle.internal.LifecycleModuleBuilder.buildProject(LifecycleModuleBuilder.java:81)
	at org.apache.maven.lifecycle.internal.builder.singlethreaded.SingleThreadedBuilder.build(SingleThreadedBuilder.java:56)
	at org.apache.maven.lifecycle.internal.LifecycleStarter.execute(LifecycleStarter.java:128)
	at org.apache.maven.DefaultMaven.doExecute(DefaultMaven.java:305)
	at org.apache.maven.DefaultMaven.doExecute(DefaultMaven.java:192)
	at org.apache.maven.DefaultMaven.execute(DefaultMaven.java:105)
	at org.apache.maven.cli.MavenCli.execute(MavenCli.java:957)
	at org.apache.maven.cli.MavenCli.doMain(MavenCli.java:289)
	at org.apache.maven.cli.MavenCli.main(MavenCli.java:193)
	at sun.reflect.NativeMethodAccessorImpl.invoke0(Native Method)
	at sun.reflect.NativeMethodAccessorImpl.invoke(NativeMethodAccessorImpl.java:62)
	at sun.reflect.DelegatingMethodAccessorImpl.invoke(DelegatingMethodAccessorImpl.java:43)
	at java.lang.reflect.Method.invoke(Method.java:498)
	at org.codehaus.plexus.classworlds.launcher.Launcher.launchEnhanced(Launcher.java:282)
	at org.codehaus.plexus.classworlds.launcher.Launcher.launch(Launcher.java:225)
	at org.codehaus.plexus.classworlds.launcher.Launcher.mainWithExitCode(Launcher.java:406)
	at org.codehaus.plexus.classworlds.launcher.Launcher.main(Launcher.java:347)
Caused by: java.lang.RuntimeException: Maven build failed! Enable verbose mode for more information (--verbose)
	at eu.stamp_project.dspot.common.automaticbuilder.maven.MavenAutomaticBuilder.runPit(MavenAutomaticBuilder.java:152)
	... 30 more

Something bad happened when DSpot tried to computed the original mutation score.
This is usually due to the value of the command line option --pit-filter-classes-to-keep.
Specify the filter of classes to keep used by PIT. This allow you restrict the scope of the mutation done by PIT. If this is not specified, DSpot will try to build on the fly a filter that takes into account the largest number of classes, e.g. the topest package. 
This is can be also due to a specific configuration of your test suite. If any test fails,
PIT (and so DSpot) won't be able to be executed. Please, check your environment variables,
external files, etc. You can use --excluded-classes and --excluded-test-cases
 to exclude respectively specific test classes ans test cases.
java.lang.RuntimeException: java.lang.RuntimeException: Maven build failed! Enable verbose mode for more information (--verbose)
	at eu.stamp_project.dspot.common.automaticbuilder.maven.MavenAutomaticBuilder.runPit(MavenAutomaticBuilder.java:155)
	at eu.stamp_project.dspot.common.automaticbuilder.maven.MavenAutomaticBuilder.runPit(MavenAutomaticBuilder.java:161)
	at eu.stamp_project.dspot.selector.PitMutantScoreSelector.init(PitMutantScoreSelector.java:109)
	at eu.stamp_project.dspot.common.configuration.AmplificationSetup.firstSelectorSetup(AmplificationSetup.java:124)
	at eu.stamp_project.dspot.DSpot.onlyAssertionGeneration(DSpot.java:72)
	at eu.stamp_project.dspot.DSpot.amplification(DSpot.java:61)
	at eu.stamp_project.dspot.DSpot.run(DSpot.java:53)
	at eu.stamp_project.Main.main(Main.java:20)
	at eu.stamp_project.DSpotMojo.execute(DSpotMojo.java:29)
	at org.apache.maven.plugin.DefaultBuildPluginManager.executeMojo(DefaultBuildPluginManager.java:137)
	at org.apache.maven.lifecycle.internal.MojoExecutor.execute(MojoExecutor.java:210)
	at org.apache.maven.lifecycle.internal.MojoExecutor.execute(MojoExecutor.java:156)
	at org.apache.maven.lifecycle.internal.MojoExecutor.execute(MojoExecutor.java:148)
	at org.apache.maven.lifecycle.internal.LifecycleModuleBuilder.buildProject(LifecycleModuleBuilder.java:117)
	at org.apache.maven.lifecycle.internal.LifecycleModuleBuilder.buildProject(LifecycleModuleBuilder.java:81)
	at org.apache.maven.lifecycle.internal.builder.singlethreaded.SingleThreadedBuilder.build(SingleThreadedBuilder.java:56)
	at org.apache.maven.lifecycle.internal.LifecycleStarter.execute(LifecycleStarter.java:128)
	at org.apache.maven.DefaultMaven.doExecute(DefaultMaven.java:305)
	at org.apache.maven.DefaultMaven.doExecute(DefaultMaven.java:192)
	at org.apache.maven.DefaultMaven.execute(DefaultMaven.java:105)
	at org.apache.maven.cli.MavenCli.execute(MavenCli.java:957)
	at org.apache.maven.cli.MavenCli.doMain(MavenCli.java:289)
	at org.apache.maven.cli.MavenCli.main(MavenCli.java:193)
	at sun.reflect.NativeMethodAccessorImpl.invoke0(Native Method)
	at sun.reflect.NativeMethodAccessorImpl.invoke(NativeMethodAccessorImpl.java:62)
	at sun.reflect.DelegatingMethodAccessorImpl.invoke(DelegatingMethodAccessorImpl.java:43)
	at java.lang.reflect.Method.invoke(Method.java:498)
	at org.codehaus.plexus.classworlds.launcher.Launcher.launchEnhanced(Launcher.java:282)
	at org.codehaus.plexus.classworlds.launcher.Launcher.launch(Launcher.java:225)
	at org.codehaus.plexus.classworlds.launcher.Launcher.mainWithExitCode(Launcher.java:406)
	at org.codehaus.plexus.classworlds.launcher.Launcher.main(Launcher.java:347)
Caused by: java.lang.RuntimeException: Maven build failed! Enable verbose mode for more information (--verbose)
	at eu.stamp_project.dspot.common.automaticbuilder.maven.MavenAutomaticBuilder.runPit(MavenAutomaticBuilder.java:152)
	... 30 more

Something bad happened when DSpot tried to computed the original mutation score.
This is usually due to the value of the command line option --pit-filter-classes-to-keep.
Specify the filter of classes to keep used by PIT. This allow you restrict the scope of the mutation done by PIT. If this is not specified, DSpot will try to build on the fly a filter that takes into account the largest number of classes, e.g. the topest package. 
This is can be also due to a specific configuration of your test suite. If any test fails,
PIT (and so DSpot) won't be able to be executed. Please, check your environment variables,
external files, etc. You can use --excluded-classes and --excluded-test-cases
 to exclude respectively specific test classes ans test cases.
java.lang.RuntimeException: java.lang.RuntimeException: Maven build failed! Enable verbose mode for more information (--verbose)
	at eu.stamp_project.dspot.common.automaticbuilder.maven.MavenAutomaticBuilder.runPit(MavenAutomaticBuilder.java:155)
	at eu.stamp_project.dspot.common.automaticbuilder.maven.MavenAutomaticBuilder.runPit(MavenAutomaticBuilder.java:161)
	at eu.stamp_project.dspot.selector.PitMutantScoreSelector.init(PitMutantScoreSelector.java:109)
	at eu.stamp_project.dspot.common.configuration.AmplificationSetup.firstSelectorSetup(AmplificationSetup.java:124)
	at eu.stamp_project.dspot.DSpot.onlyAssertionGeneration(DSpot.java:72)
	at eu.stamp_project.dspot.DSpot.amplification(DSpot.java:61)
	at eu.stamp_project.dspot.DSpot.run(DSpot.java:53)
	at eu.stamp_project.Main.main(Main.java:20)
	at eu.stamp_project.DSpotMojo.execute(DSpotMojo.java:29)
	at org.apache.maven.plugin.DefaultBuildPluginManager.executeMojo(DefaultBuildPluginManager.java:137)
	at org.apache.maven.lifecycle.internal.MojoExecutor.execute(MojoExecutor.java:210)
	at org.apache.maven.lifecycle.internal.MojoExecutor.execute(MojoExecutor.java:156)
	at org.apache.maven.lifecycle.internal.MojoExecutor.execute(MojoExecutor.java:148)
	at org.apache.maven.lifecycle.internal.LifecycleModuleBuilder.buildProject(LifecycleModuleBuilder.java:117)
	at org.apache.maven.lifecycle.internal.LifecycleModuleBuilder.buildProject(LifecycleModuleBuilder.java:81)
	at org.apache.maven.lifecycle.internal.builder.singlethreaded.SingleThreadedBuilder.build(SingleThreadedBuilder.java:56)
	at org.apache.maven.lifecycle.internal.LifecycleStarter.execute(LifecycleStarter.java:128)
	at org.apache.maven.DefaultMaven.doExecute(DefaultMaven.java:305)
	at org.apache.maven.DefaultMaven.doExecute(DefaultMaven.java:192)
	at org.apache.maven.DefaultMaven.execute(DefaultMaven.java:105)
	at org.apache.maven.cli.MavenCli.execute(MavenCli.java:957)
	at org.apache.maven.cli.MavenCli.doMain(MavenCli.java:289)
	at org.apache.maven.cli.MavenCli.main(MavenCli.java:193)
	at sun.reflect.NativeMethodAccessorImpl.invoke0(Native Method)
	at sun.reflect.NativeMethodAccessorImpl.invoke(NativeMethodAccessorImpl.java:62)
	at sun.reflect.DelegatingMethodAccessorImpl.invoke(DelegatingMethodAccessorImpl.java:43)
	at java.lang.reflect.Method.invoke(Method.java:498)
	at org.codehaus.plexus.classworlds.launcher.Launcher.launchEnhanced(Launcher.java:282)
	at org.codehaus.plexus.classworlds.launcher.Launcher.launch(Launcher.java:225)
	at org.codehaus.plexus.classworlds.launcher.Launcher.mainWithExitCode(Launcher.java:406)
	at org.codehaus.plexus.classworlds.launcher.Launcher.main(Launcher.java:347)
Caused by: java.lang.RuntimeException: Maven build failed! Enable verbose mode for more information (--verbose)
	at eu.stamp_project.dspot.common.automaticbuilder.maven.MavenAutomaticBuilder.runPit(MavenAutomaticBuilder.java:152)
	... 30 more

Something bad happened when DSpot tried to computed the original mutation score.
This is usually due to the value of the command line option --pit-filter-classes-to-keep.
Specify the filter of classes to keep used by PIT. This allow you restrict the scope of the mutation done by PIT. If this is not specified, DSpot will try to build on the fly a filter that takes into account the largest number of classes, e.g. the topest package. 
This is can be also due to a specific configuration of your test suite. If any test fails,
PIT (and so DSpot) won't be able to be executed. Please, check your environment variables,
external files, etc. You can use --excluded-classes and --excluded-test-cases
 to exclude respectively specific test classes ans test cases.
java.lang.RuntimeException: java.lang.RuntimeException: Maven build failed! Enable verbose mode for more information (--verbose)
	at eu.stamp_project.dspot.common.automaticbuilder.maven.MavenAutomaticBuilder.runPit(MavenAutomaticBuilder.java:155)
	at eu.stamp_project.dspot.common.automaticbuilder.maven.MavenAutomaticBuilder.runPit(MavenAutomaticBuilder.java:161)
	at eu.stamp_project.dspot.selector.PitMutantScoreSelector.init(PitMutantScoreSelector.java:109)
	at eu.stamp_project.dspot.common.configuration.AmplificationSetup.firstSelectorSetup(AmplificationSetup.java:124)
	at eu.stamp_project.dspot.DSpot.onlyAssertionGeneration(DSpot.java:72)
	at eu.stamp_project.dspot.DSpot.amplification(DSpot.java:61)
	at eu.stamp_project.dspot.DSpot.run(DSpot.java:53)
	at eu.stamp_project.Main.main(Main.java:20)
	at eu.stamp_project.DSpotMojo.execute(DSpotMojo.java:29)
	at org.apache.maven.plugin.DefaultBuildPluginManager.executeMojo(DefaultBuildPluginManager.java:137)
	at org.apache.maven.lifecycle.internal.MojoExecutor.execute(MojoExecutor.java:210)
	at org.apache.maven.lifecycle.internal.MojoExecutor.execute(MojoExecutor.java:156)
	at org.apache.maven.lifecycle.internal.MojoExecutor.execute(MojoExecutor.java:148)
	at org.apache.maven.lifecycle.internal.LifecycleModuleBuilder.buildProject(LifecycleModuleBuilder.java:117)
	at org.apache.maven.lifecycle.internal.LifecycleModuleBuilder.buildProject(LifecycleModuleBuilder.java:81)
	at org.apache.maven.lifecycle.internal.builder.singlethreaded.SingleThreadedBuilder.build(SingleThreadedBuilder.java:56)
	at org.apache.maven.lifecycle.internal.LifecycleStarter.execute(LifecycleStarter.java:128)
	at org.apache.maven.DefaultMaven.doExecute(DefaultMaven.java:305)
	at org.apache.maven.DefaultMaven.doExecute(DefaultMaven.java:192)
	at org.apache.maven.DefaultMaven.execute(DefaultMaven.java:105)
	at org.apache.maven.cli.MavenCli.execute(MavenCli.java:957)
	at org.apache.maven.cli.MavenCli.doMain(MavenCli.java:289)
	at org.apache.maven.cli.MavenCli.main(MavenCli.java:193)
	at sun.reflect.NativeMethodAccessorImpl.invoke0(Native Method)
	at sun.reflect.NativeMethodAccessorImpl.invoke(NativeMethodAccessorImpl.java:62)
	at sun.reflect.DelegatingMethodAccessorImpl.invoke(DelegatingMethodAccessorImpl.java:43)
	at java.lang.reflect.Method.invoke(Method.java:498)
	at org.codehaus.plexus.classworlds.launcher.Launcher.launchEnhanced(Launcher.java:282)
	at org.codehaus.plexus.classworlds.launcher.Launcher.launch(Launcher.java:225)
	at org.codehaus.plexus.classworlds.launcher.Launcher.mainWithExitCode(Launcher.java:406)
	at org.codehaus.plexus.classworlds.launcher.Launcher.main(Launcher.java:347)
Caused by: java.lang.RuntimeException: Maven build failed! Enable verbose mode for more information (--verbose)
	at eu.stamp_project.dspot.common.automaticbuilder.maven.MavenAutomaticBuilder.runPit(MavenAutomaticBuilder.java:152)
	... 30 more

Something bad happened when DSpot tried to computed the original mutation score.
This is usually due to the value of the command line option --pit-filter-classes-to-keep.
Specify the filter of classes to keep used by PIT. This allow you restrict the scope of the mutation done by PIT. If this is not specified, DSpot will try to build on the fly a filter that takes into account the largest number of classes, e.g. the topest package. 
This is can be also due to a specific configuration of your test suite. If any test fails,
PIT (and so DSpot) won't be able to be executed. Please, check your environment variables,
external files, etc. You can use --excluded-classes and --excluded-test-cases
 to exclude respectively specific test classes ans test cases.
java.lang.RuntimeException: java.lang.RuntimeException: Maven build failed! Enable verbose mode for more information (--verbose)
	at eu.stamp_project.dspot.common.automaticbuilder.maven.MavenAutomaticBuilder.runPit(MavenAutomaticBuilder.java:155)
	at eu.stamp_project.dspot.common.automaticbuilder.maven.MavenAutomaticBuilder.runPit(MavenAutomaticBuilder.java:161)
	at eu.stamp_project.dspot.selector.PitMutantScoreSelector.init(PitMutantScoreSelector.java:109)
	at eu.stamp_project.dspot.common.configuration.AmplificationSetup.firstSelectorSetup(AmplificationSetup.java:124)
	at eu.stamp_project.dspot.DSpot.onlyAssertionGeneration(DSpot.java:72)
	at eu.stamp_project.dspot.DSpot.amplification(DSpot.java:61)
	at eu.stamp_project.dspot.DSpot.run(DSpot.java:53)
	at eu.stamp_project.Main.main(Main.java:20)
	at eu.stamp_project.DSpotMojo.execute(DSpotMojo.java:29)
	at org.apache.maven.plugin.DefaultBuildPluginManager.executeMojo(DefaultBuildPluginManager.java:137)
	at org.apache.maven.lifecycle.internal.MojoExecutor.execute(MojoExecutor.java:210)
	at org.apache.maven.lifecycle.internal.MojoExecutor.execute(MojoExecutor.java:156)
	at org.apache.maven.lifecycle.internal.MojoExecutor.execute(MojoExecutor.java:148)
	at org.apache.maven.lifecycle.internal.LifecycleModuleBuilder.buildProject(LifecycleModuleBuilder.java:117)
	at org.apache.maven.lifecycle.internal.LifecycleModuleBuilder.buildProject(LifecycleModuleBuilder.java:81)
	at org.apache.maven.lifecycle.internal.builder.singlethreaded.SingleThreadedBuilder.build(SingleThreadedBuilder.java:56)
	at org.apache.maven.lifecycle.internal.LifecycleStarter.execute(LifecycleStarter.java:128)
	at org.apache.maven.DefaultMaven.doExecute(DefaultMaven.java:305)
	at org.apache.maven.DefaultMaven.doExecute(DefaultMaven.java:192)
	at org.apache.maven.DefaultMaven.execute(DefaultMaven.java:105)
	at org.apache.maven.cli.MavenCli.execute(MavenCli.java:957)
	at org.apache.maven.cli.MavenCli.doMain(MavenCli.java:289)
	at org.apache.maven.cli.MavenCli.main(MavenCli.java:193)
	at sun.reflect.NativeMethodAccessorImpl.invoke0(Native Method)
	at sun.reflect.NativeMethodAccessorImpl.invoke(NativeMethodAccessorImpl.java:62)
	at sun.reflect.DelegatingMethodAccessorImpl.invoke(DelegatingMethodAccessorImpl.java:43)
	at java.lang.reflect.Method.invoke(Method.java:498)
	at org.codehaus.plexus.classworlds.launcher.Launcher.launchEnhanced(Launcher.java:282)
	at org.codehaus.plexus.classworlds.launcher.Launcher.launch(Launcher.java:225)
	at org.codehaus.plexus.classworlds.launcher.Launcher.mainWithExitCode(Launcher.java:406)
	at org.codehaus.plexus.classworlds.launcher.Launcher.main(Launcher.java:347)
Caused by: java.lang.RuntimeException: Maven build failed! Enable verbose mode for more information (--verbose)
	at eu.stamp_project.dspot.common.automaticbuilder.maven.MavenAutomaticBuilder.runPit(MavenAutomaticBuilder.java:152)
	... 30 more

Something bad happened when DSpot tried to computed the original mutation score.
This is usually due to the value of the command line option --pit-filter-classes-to-keep.
Specify the filter of classes to keep used by PIT. This allow you restrict the scope of the mutation done by PIT. If this is not specified, DSpot will try to build on the fly a filter that takes into account the largest number of classes, e.g. the topest package. 
This is can be also due to a specific configuration of your test suite. If any test fails,
PIT (and so DSpot) won't be able to be executed. Please, check your environment variables,
external files, etc. You can use --excluded-classes and --excluded-test-cases
 to exclude respectively specific test classes ans test cases.
java.lang.RuntimeException: java.lang.RuntimeException: Maven build failed! Enable verbose mode for more information (--verbose)
	at eu.stamp_project.dspot.common.automaticbuilder.maven.MavenAutomaticBuilder.runPit(MavenAutomaticBuilder.java:155)
	at eu.stamp_project.dspot.common.automaticbuilder.maven.MavenAutomaticBuilder.runPit(MavenAutomaticBuilder.java:161)
	at eu.stamp_project.dspot.selector.PitMutantScoreSelector.init(PitMutantScoreSelector.java:109)
	at eu.stamp_project.dspot.common.configuration.AmplificationSetup.firstSelectorSetup(AmplificationSetup.java:124)
	at eu.stamp_project.dspot.DSpot.onlyAssertionGeneration(DSpot.java:72)
	at eu.stamp_project.dspot.DSpot.amplification(DSpot.java:61)
	at eu.stamp_project.dspot.DSpot.run(DSpot.java:53)
	at eu.stamp_project.Main.main(Main.java:20)
	at eu.stamp_project.DSpotMojo.execute(DSpotMojo.java:29)
	at org.apache.maven.plugin.DefaultBuildPluginManager.executeMojo(DefaultBuildPluginManager.java:137)
	at org.apache.maven.lifecycle.internal.MojoExecutor.execute(MojoExecutor.java:210)
	at org.apache.maven.lifecycle.internal.MojoExecutor.execute(MojoExecutor.java:156)
	at org.apache.maven.lifecycle.internal.MojoExecutor.execute(MojoExecutor.java:148)
	at org.apache.maven.lifecycle.internal.LifecycleModuleBuilder.buildProject(LifecycleModuleBuilder.java:117)
	at org.apache.maven.lifecycle.internal.LifecycleModuleBuilder.buildProject(LifecycleModuleBuilder.java:81)
	at org.apache.maven.lifecycle.internal.builder.singlethreaded.SingleThreadedBuilder.build(SingleThreadedBuilder.java:56)
	at org.apache.maven.lifecycle.internal.LifecycleStarter.execute(LifecycleStarter.java:128)
	at org.apache.maven.DefaultMaven.doExecute(DefaultMaven.java:305)
	at org.apache.maven.DefaultMaven.doExecute(DefaultMaven.java:192)
	at org.apache.maven.DefaultMaven.execute(DefaultMaven.java:105)
	at org.apache.maven.cli.MavenCli.execute(MavenCli.java:957)
	at org.apache.maven.cli.MavenCli.doMain(MavenCli.java:289)
	at org.apache.maven.cli.MavenCli.main(MavenCli.java:193)
	at sun.reflect.NativeMethodAccessorImpl.invoke0(Native Method)
	at sun.reflect.NativeMethodAccessorImpl.invoke(NativeMethodAccessorImpl.java:62)
	at sun.reflect.DelegatingMethodAccessorImpl.invoke(DelegatingMethodAccessorImpl.java:43)
	at java.lang.reflect.Method.invoke(Method.java:498)
	at org.codehaus.plexus.classworlds.launcher.Launcher.launchEnhanced(Launcher.java:282)
	at org.codehaus.plexus.classworlds.launcher.Launcher.launch(Launcher.java:225)
	at org.codehaus.plexus.classworlds.launcher.Launcher.mainWithExitCode(Launcher.java:406)
	at org.codehaus.plexus.classworlds.launcher.Launcher.main(Launcher.java:347)
Caused by: java.lang.RuntimeException: Maven build failed! Enable verbose mode for more information (--verbose)
	at eu.stamp_project.dspot.common.automaticbuilder.maven.MavenAutomaticBuilder.runPit(MavenAutomaticBuilder.java:152)
	... 30 more

[INFO] The amplification ends up with 0 amplified test methods over 7 test classes.
[INFO] Print com.github.valfirst.jbehave.junit.monitoring.IgnoredTestsTest.java with 0 amplified test cases in ../output/dspot/original/
[INFO] Print com.github.valfirst.jbehave.junit.monitoring.JUnitDescriptionGeneratorTest.java with 0 amplified test cases in ../output/dspot/original/
[INFO] Print com.github.valfirst.jbehave.junit.monitoring.JUnitReportingRunnerIntegrationTest.java with 0 amplified test cases in ../output/dspot/original/
[INFO] Print com.github.valfirst.jbehave.junit.monitoring.JUnitReportingRunnerTest.java with 0 amplified test cases in ../output/dspot/original/
[INFO] Print com.github.valfirst.jbehave.junit.monitoring.JUnitScenarioReporterTest.java with 0 amplified test cases in ../output/dspot/original/
[INFO] Print com.github.valfirst.jbehave.junit.monitoring.JUnitStringDecoratorTest.java with 0 amplified test cases in ../output/dspot/original/
[INFO] Print com.github.valfirst.jbehave.junit.monitoring.StoryPathsExtractorTest.java with 0 amplified test cases in ../output/dspot/original/
[INFO] ------------------------------------------------------------------------
[INFO] BUILD SUCCESS
[INFO] ------------------------------------------------------------------------
[INFO] Total time:  38.551 s
[INFO] Finished at: 2021-08-12T08:38:34Z
[INFO] ------------------------------------------------------------------------